program: Gaussian 09
title: 000029988
version: EM64L-G09RevD.01
frameworkgroup: C1[X(C18H24Cl2N2O2)]
method: RPBEPBE
basis: SDD
operation: Freq
keyword: #p
keyword: freq=noraman
keyword: PBEPBE/SDD
title: #p freq=noraman PBEPBE/SDD
converged: YES YES NO NO
title: Mulliken charges:
elementType: Cl Cl O O N N C C C C C C C C C C C C C C C C C C H H H H H H H H H H H H H H H H H H H H H H H H
charge: -0.041806 -0.017497 -0.322407 -0.242859 -0.115285 -0.468359 0.037264 -0.077148 -0.457781 -0.471773 -0.398257 -0.385176 -0.380420 -0.357778 -0.408241 -0.403814 -0.400955 0.277763 0.670618 -0.300667 -0.253586 -0.232047 -0.234793 -0.217060 0.167345 0.281184 0.195433 0.232776 0.235026 0.206100 0.192293 0.201993 0.212007 0.199487 0.165659 0.248601 0.202383 0.167087 0.193008 0.206671 0.205987 0.187663 0.212907 0.187649 0.337375 0.260968 0.260357 0.242103
chargesum: 0.00000
title: Mulliken charges with hydrogens summed into heavy atoms:
elementType: Cl Cl O O N N C C C C C C C C C C C C C C C C C C
charge: -0.041806 -0.017497 -0.322407 -0.242859 -0.115285 -0.130983 0.204609 0.204036 -0.029573 -0.030648 -0.003971 0.026318 0.033841 0.011693 -0.008562 -0.010163 -0.000399 0.277763 0.670618 -0.300667 -0.253586 0.028921 0.025564 0.025043
polarizability: 2.83118771e+02 -3.02634150e+00 2.49075775e+02 -1.27342217e+00 -1.77179161e+01 1.61437501e+02
1716.lowfreq: -7.8982 -0.0018 -0.0017 -0.0015 1.9406 4.6535 8.9191 17.1824 33.0872
frequency: 8.2270 17.0344 32.9735 47.5767 50.8114 70.7573 79.6361 83.6332 111.3450 130.3953 164.1771 189.3639 194.8856 200.5121 221.1704 238.6549 252.7877 261.9106 278.6230 295.0221 301.3025 318.1604 358.9674 376.2086 383.0011 399.9099 422.1911 444.4513 454.2434 479.7980 481.8347 511.1046 516.3561 533.5965 548.5543 596.6750 609.4767 627.7694 687.4938 699.9799 733.2433 751.8484 755.5623 771.3803 791.3261 803.0060 805.7988 844.5898 854.2439 856.7084 872.4506 888.3063 892.0481 903.8791 917.3695 935.9176 957.5902 964.0470 968.1210 989.8759 1007.5924 1045.3721 1047.1162 1060.8139 1063.9761 1069.6560 1079.9007 1099.2778 1100.7859 1109.5467 1120.3753 1142.4258 1143.7218 1155.6540 1157.0664 1166.2996 1193.5667 1197.4838 1226.0136 1235.4528 1252.7529 1258.0116 1270.2347 1271.6560 1288.2251 1297.3926 1309.5767 1320.3405 1330.6744 1335.0240 1336.8312 1341.4522 1345.0277 1349.8450 1353.6869 1356.7839 1361.4682 1381.8913 1388.8228 1413.8947 1446.9409 1452.4698 1460.8745 1462.1551 1462.4482 1464.0327 1466.8986 1469.3688 1476.3895 1478.0107 1487.1291 1564.1156 1593.8958 1666.5593 2793.3589 2804.2502 2821.8277 2963.0198 2965.6708 2981.9808 2984.7326 2986.8343 2988.4020 3005.2125 3031.2854 3032.1048 3041.9794 3042.9069 3045.7484 3049.8871 3053.1550 3054.0208 3067.7000 3073.4909 3154.7807 3174.1645 3185.5700 3538.9925
redmass: 7.2137 5.9125 3.5183 5.9804 5.3639 6.0042 4.5007 4.4689 5.0270 5.0019 5.0098 3.4092 4.7116 5.7138 4.0127 2.3918 2.7927 5.5502 3.1549 5.2351 2.7477 4.2084 2.1965 3.2051 7.3528 2.2769 3.8382 2.7851 2.7309 2.3229 3.6323 5.2450 1.7489 2.6689 2.5918 2.9137 3.4361 4.0370 4.8781 7.7531 6.7425 3.2845 3.2215 1.4284 3.1398 2.3788 1.5723 2.2018 2.0774 1.8651 2.4687 3.5584 1.3546 1.7025 2.4243 2.3522 1.3606 1.3448 2.8857 5.6992 2.4121 1.5936 1.8325 3.4170 2.5380 2.2241 1.4575 1.9766 1.5375 2.2288 2.5122 1.9675 1.4524 1.7113 1.6220 2.4744 1.4593 1.5828 1.7103 1.3782 1.2547 1.2708 1.2549 1.9271 1.2275 1.2537 1.4247 1.4176 1.3307 1.5055 1.3814 1.4215 1.4855 1.5210 1.7013 2.4120 1.7806 1.4167 1.4020 2.3040 2.2819 1.0906 1.0892 1.0894 1.0882 1.0810 1.0955 1.0962 1.1223 1.1047 2.7315 6.3036 8.5785 9.0941 1.0785 1.0720 1.0709 1.0636 1.0624 1.0621 1.0611 1.0613 1.0632 1.0627 1.0962 1.0938 1.0971 1.0928 1.0979 1.0867 1.1024 1.1022 1.1022 1.0869 1.0873 1.0930 1.0998 1.0761
irintensity: 0.0325 0.4061 0.6092 1.2259 1.0394 3.8668 0.9404 1.5382 0.6264 0.6392 0.1538 1.4845 1.2642 4.6083 2.4710 0.2387 3.0992 3.5992 0.8297 5.5640 4.0468 3.8697 1.4588 8.5774 6.4916 3.2285 1.0540 1.3460 3.8110 1.1163 9.0848 2.8463 50.5977 2.3700 33.7783 2.3989 1.1032 1.3859 7.3163 23.3315 76.7215 31.4334 4.1993 65.0521 3.0800 5.1314 1.5717 28.0250 0.5253 2.9944 21.0099 19.4517 0.0452 2.9074 6.5847 6.9769 2.2624 1.9307 16.0800 161.8179 27.0492 16.4141 2.4519 6.1647 74.7221 1.1376 7.0846 24.8555 10.2389 40.7893 3.5965 30.6289 5.1960 59.5419 57.9754 394.9339 25.9337 36.0060 10.6744 1.9322 0.5076 3.2522 6.8462 12.7378 2.6511 5.8783 0.9843 2.0772 6.9323 4.7130 6.9515 2.7568 8.4808 7.6855 13.5141 25.2820 14.7216 11.5228 1.7477 87.1712 11.0694 7.2422 6.8953 17.8232 7.6817 1.4149 13.3106 9.2211 52.6064 7.1206 490.7094 32.3647 12.7914 170.0186 39.3776 64.1463 192.5311 45.3661 42.7649 24.0390 46.2459 34.1692 27.3870 23.7259 61.5931 60.9147 26.9241 76.6015 1.3372 4.2315 21.6497 118.1104 63.4281 26.6867 3.3115 0.9674 6.3613 40.4741
temp: 298.150 k
press: 1.00000 atm
elementType: 17 17 8 8 7 7 6 6 6 6 6 6 6 6 6 6 6 6 6 6 6 6 6 6 1 1 1 1 1 1 1 1 1 1 1 1 1 1 1 1 1 1 1 1 1 1 1 1
symmnumber: 1
zpe: 1033070.7 jmol-1
zpe.correction: 0.393476 hartree
zpe.thermalcorrener: 0.416571 hartree
zpe.thermalcorrenthalpy: 0.417516 hartree
zpe.thermalcorrgfe: 0.337878 hartree
zpe.sumelectzpe: -1878.565733 hartree
zpe.sumelectthermal: -1878.542638 hartree
zpe.sumelectthermalent: -1878.541694 hartree
zpe.sumelectthermalfe: -1878.621331 hartree
dipole: 0.5346 0.3093 -1.0575
dipole: 1.2246
quadrupole: -129.4860 -152.6205 -162.2119
quadrupole: -7.4714 -4.9631 0.0814
quadrupole: 18.6201 -4.5144 -14.1058 -7.4714 -4.9631 0.0814
hfenergy: -1878.9592093 hartree
pointgroup: C01 [X(C18H24Cl2N2O2)]
dipole: 0.2166568 0.0535643 -0.4270039 debye
polarizability: 281.8611206|-7.5554341|245.7669213|-4.331765|-25.9842133|166.004006 unknown
InChI: InChI=1S/C18H24Cl2N2O2/c19-13-7-6-8-14(20)17(13)21-18(23)24-16-10-3-2-9-15(16)22-11-4-1-5-12-22/h6-8,15-16,21H,1-5,9-12H2
charge 0 multiplicity 1
48 atoms
Cl 4.032395 1.660209 -1.51182
Cl 1.519239 -2.791353 0.762256
O  -0.357195 0.997095 -0.034841
O  0.898263 0.15005 1.776783
N  -3.111227 -0.120444 -0.263564
N  1.659052 0.082403 -0.464114
C  -2.788845 1.278923 0.154765
C  -1.446983 1.428789 0.904845
C  -2.8124 2.247353 -1.059197
C  -1.183758 2.886545 1.332459
C  -2.584191 3.715122 -0.624161
C  -1.250765 3.870054 0.143639
C  -2.64257 -1.195619 0.652522
C  -4.568096 -0.274444 -0.530453
C  -2.898527 -2.590308 0.042765
C  -4.888911 -1.63619 -1.178872
C  -4.392989 -2.794356 -0.285797
C  0.75192 0.381846 0.554609
C  2.899095 -0.5668 -0.258769
C  4.113725 0.031228 -0.694734
C  3.011609 -1.855365 0.333499
C  5.369973 -0.574465 -0.526514
C  4.258267 -2.473459 0.548697
C  5.438358 -1.829233 0.118969
H  -3.552429 1.640749 0.899368
H  -1.391868 0.773278 1.791226
H  -3.775188 2.163147 -1.594042
H  -2.021319 1.926776 -1.761723
H  -0.201329 2.935514 1.837684
H  -1.94696 3.15973 2.089538
H  -3.422973 4.043562 0.025268
H  -2.592834 4.374563 -1.513174
H  -0.407303 3.666924 -0.544301
H  -1.130436 4.907759 0.508909
H  -3.153848 -1.135833 1.651536
H  -1.560504 -1.087854 0.826818
H  -4.902179 0.537985 -1.198979
H  -5.155832 -0.17812 0.423638
H  -2.542205 -3.363372 0.750808
H  -2.298549 -2.682114 -0.883081
H  -4.388336 -1.686968 -2.165005
H  -5.980529 -1.711263 -1.350227
H  -4.554869 -3.769545 -0.78312
H  -4.979409 -2.80953 0.656626
H  1.471375 0.513759 -1.372101
H  6.273023 -0.068748 -0.877886
H  4.297572 -3.457973 1.022337
H  6.409092 -2.309209 0.275011
