program: Gaussian 09
title: 000029994
version: EM64L-G09RevD.01
frameworkgroup: C1[X(C20H32N2O2)]
method: RPBEPBE
basis: SDD
operation: Freq
keyword: #p
keyword: freq=noraman
keyword: PBEPBE/SDD
title: #p freq=noraman PBEPBE/SDD
converged: YES YES NO NO
title: Mulliken charges:
elementType: O O N N C C C C C C C C C C C C C C C C C C C C H H H H H H H H H H H H H H H H H H H H H H H H H H H H H H H H
charge: -0.332734 -0.268644 -0.124818 -0.474995 0.032982 -0.058464 -0.454028 -0.478436 -0.397824 -0.383327 -0.307350 -0.411100 -0.721142 -0.695635 0.252257 0.122042 0.357488 0.381301 -0.608986 -0.598215 0.489750 -0.839311 -0.837787 -0.817291 0.160699 0.268163 0.232705 0.190900 0.204660 0.237772 0.200468 0.192792 0.197604 0.209202 0.204985 0.175843 0.251689 0.224320 0.230606 0.217153 0.211247 0.217468 0.218514 0.220936 0.325252 0.236143 0.235904 0.243702 0.235156 0.224917 0.282286 0.223284 0.217596 0.235887 0.222390 0.224023
chargesum: 0.00000
title: Mulliken charges with hydrogens summed into heavy atoms:
elementType: O O N N C C C C C C C C C C C C C C C C C C C C
charge: -0.332734 -0.268644 -0.124818 -0.149743 0.193681 0.209699 -0.030422 -0.036004 -0.004564 0.023479 0.073479 0.064909 -0.062136 -0.038717 0.252257 0.122042 0.357488 0.381301 -0.372843 -0.362311 0.489750 -0.135536 -0.114620 -0.134991
polarizability: 3.06618764e+02 -4.74726804e+00 2.38337281e+02 1.40609702e+00 -1.54535315e+01 1.79937990e+02
1716.lowfreq: -30.8201 -11.0234 -7.1763 -0.0004 -0.0001 0.0003 3.2601 8.9909 20.2208
frequency: -30.6837 3.4635 20.1760 28.9712 42.4561 54.5337 73.3909 84.5428 86.0864 98.5297 118.4127 146.7845 154.1677 168.1733 173.3056 183.4947 190.4023 202.5268 217.8173 227.3791 233.7314 264.8285 271.9561 279.0728 289.3000 308.9278 313.1501 318.9624 335.1994 363.2987 382.1781 412.7761 462.1591 491.5420 492.6324 502.0389 517.1973 524.8893 544.1400 564.3194 565.6429 571.6821 600.5506 613.2901 693.9116 711.5116 736.9472 742.4813 769.7096 776.0120 794.8538 814.0462 829.3029 859.9442 866.7452 880.5259 895.3201 903.1549 906.9988 932.4168 941.0010 952.2255 956.9894 983.2437 999.4460 1014.4352 1019.4725 1039.1271 1042.9954 1044.2971 1047.1173 1048.0092 1054.0136 1057.5957 1065.0212 1083.8386 1099.3295 1102.3507 1117.2894 1139.5997 1150.1303 1172.3320 1178.0211 1197.3443 1212.1297 1236.2539 1244.6736 1250.6630 1261.2904 1281.6285 1297.6395 1307.3873 1311.5586 1323.7614 1326.6330 1332.9193 1335.8615 1342.6529 1345.5324 1357.7596 1368.3614 1369.6864 1373.8512 1382.7178 1389.6278 1395.6850 1398.0403 1399.2086 1416.0124 1445.3279 1456.7324 1457.9421 1458.4328 1465.2569 1466.3866 1467.1614 1467.2103 1472.4241 1472.9932 1474.9115 1477.6381 1480.0230 1481.6578 1490.7825 1493.4911 1500.1333 1505.1202 1599.2650 1620.5139 1662.2279 2802.8840 2844.1767 2961.8582 2963.0045 2973.0202 2977.6990 2978.2011 2978.9409 2984.4604 2985.3288 3005.5794 3012.1025 3030.8275 3039.2638 3041.0029 3041.6017 3050.6608 3052.2020 3053.8123 3054.5798 3059.3915 3068.1908 3073.5164 3078.0859 3082.0718 3082.4280 3085.2589 3088.2724 3089.0467 3114.7247 3118.9096 3530.7259
redmass: 1.0132 3.8630 4.0473 3.1674 3.9404 4.5429 2.9852 3.3559 3.5951 3.2693 2.9298 2.8341 1.2262 1.2833 1.2690 2.6039 2.0698 2.8666 1.6709 2.3562 2.9158 2.7395 2.2376 2.4728 2.2865 2.5609 3.3806 3.1186 3.2278 4.3228 2.3585 2.6675 2.1012 3.0083 2.9567 3.5319 3.1055 3.8624 3.6514 3.3023 2.4638 2.8698 1.5644 3.3673 8.2337 4.3950 3.7141 2.5629 1.1615 2.7219 1.5979 1.5764 2.2859 2.2747 1.4286 2.5941 1.3135 2.0698 1.7079 2.5097 2.5542 2.7787 2.8264 5.3871 2.6340 1.6653 1.6544 1.6667 1.5178 1.6775 1.5547 2.1358 1.6201 2.0428 2.0621 2.0142 1.7200 1.6546 1.8570 1.8440 3.0068 2.0178 1.9423 2.0746 1.7973 1.3847 1.8749 1.2229 1.5356 1.1794 1.1906 1.3845 1.2486 1.5299 4.4747 1.3372 1.4284 1.4269 1.3611 1.4480 1.5145 3.6413 1.2495 1.3125 1.3231 1.2313 1.2697 1.2529 2.5555 1.6267 1.1150 1.0896 1.0877 1.0646 1.0729 1.0603 1.0756 1.1179 1.0621 1.1111 1.0494 1.2760 1.0562 1.2982 1.1048 1.8526 1.0753 6.5741 5.9666 8.5102 1.0793 1.0723 1.0637 1.0415 1.0384 1.0365 1.0365 1.0614 1.0360 1.0620 1.0631 1.0639 1.0932 1.0863 1.0928 1.0972 1.0895 1.1009 1.0951 1.0948 1.0970 1.1023 1.0985 1.0980 1.0997 1.1002 1.0998 1.0983 1.1004 1.0911 1.0919 1.0755
irintensity: 0.4332 0.0566 1.1644 0.5234 0.2280 0.9327 0.1516 1.6588 1.8059 1.2676 0.0290 0.5248 2.6711 0.4549 1.9994 2.4319 3.9628 3.1982 2.7737 0.7360 5.1680 0.6311 0.5772 2.3921 1.7447 0.0650 0.5686 4.2257 4.7152 1.4074 0.9613 8.9062 2.2686 1.3293 5.3225 1.2393 0.8022 0.8329 1.9634 7.7854 29.7961 2.6180 49.3159 4.6938 23.0121 16.4572 3.8572 7.4313 15.9992 3.6738 6.6595 1.6759 5.5982 3.3424 23.8981 18.4323 0.2836 4.0061 4.8681 20.2967 11.7824 8.1574 8.4529 268.1127 32.9749 4.9277 3.2235 2.1378 18.7727 6.0107 13.8810 3.6976 19.3992 8.0869 58.5466 10.7671 34.7865 8.7520 12.4137 25.8675 264.6960 116.3115 101.6860 15.4680 14.0917 2.4037 15.4358 2.8242 24.8791 14.7905 4.6835 2.4725 2.0632 3.1334 0.9810 7.8192 2.6467 2.0546 10.8880 23.1654 20.6842 15.0420 26.4031 13.2357 12.9212 9.6076 27.9605 1.7778 10.1088 41.5046 64.3209 4.7847 5.6456 1.1843 6.5601 12.0412 43.8304 41.5461 12.0950 22.9954 4.8157 93.7829 24.3256 53.1586 26.8899 233.9568 11.5240 8.5603 10.9979 192.8748 70.1086 124.0824 47.6265 33.9563 44.5619 23.9576 12.1827 36.4227 39.8947 22.7697 25.9731 33.2470 55.1112 23.3149 13.0180 48.2996 25.1945 37.5774 22.8919 4.2673 12.5164 49.0055 36.2890 115.2376 17.3066 33.1727 20.9290 22.5497 41.6903 28.0120 16.7657 23.5261
temp: 298.150 k
press: 1.00000 atm
elementType: 8 8 7 7 6 6 6 6 6 6 6 6 6 6 6 6 6 6 6 6 6 6 6 6 1 1 1 1 1 1 1 1 1 1 1 1 1 1 1 1 1 1 1 1 1 1 1 1 1 1 1 1 1 1 1 1
symmnumber: 1
zpe: 1274598.2 jmol-1
zpe.correction: 0.485469 hartree
zpe.thermalcorrener: 0.511271 hartree
zpe.thermalcorrenthalpy: 0.512216 hartree
zpe.thermalcorrgfe: 0.427003 hartree
zpe.sumelectzpe: -1039.424715 hartree
zpe.sumelectthermal: -1039.398912 hartree
zpe.sumelectthermalent: -1039.397968 hartree
zpe.sumelectthermalfe: -1039.483181 hartree
dipole: -0.6044 0.8250 -1.4143
dipole: 1.7454
quadrupole: -129.4970 -138.6348 -151.9620
quadrupole: 0.6221 -4.9521 -2.7460
quadrupole: 10.5343 1.3964 -11.9308 0.6221 -4.9521 -2.7460
hfenergy: -1039.9101835 hartree
pointgroup: C01 [X(C20H32N2O2)]
dipole: 0.1990734 0.2932947 0.5881149 debye
polarizability: 305.4409509|9.084128|236.3859824|4.1216938|20.4812907|183.0671025 unknown
InChI: InChI=1S/C20H32N2O2/c1-6-22(7-2)17-10-8-9-11-18(17)24-20(23)21-19-15(4)12-14(3)13-16(19)5/h12-13,17-18,21H,6-11H2,1-5H3
charge 0 multiplicity 1
56 atoms
O  0.971902 0.778519 0.071251
O  -0.330822 0.046601 -1.76009
N  3.522474 -0.683623 0.562432
N  -1.19319 0.249196 0.437998
C  3.423918 0.700829 0.003941
C  2.150179 0.953582 -0.836752
C  3.508791 1.775512 1.124615
C  2.122321 2.380989 -1.421814
C  3.507669 3.210422 0.543229
C  2.256572 3.463397 -0.329107
C  4.896674 -0.985871 1.048266
C  2.943141 -1.775606 -0.264876
C  4.986666 -2.273162 1.890087
C  3.672237 -2.115099 -1.596753
C  -0.215875 0.325536 -0.539463
C  -2.566724 -0.121781 0.233845
C  -3.573005 0.785326 0.678572
C  -2.912865 -1.379988 -0.336922
C  -4.930436 0.424806 0.523457
C  -4.287569 -1.686078 -0.488427
C  -5.311058 -0.801544 -0.074013
C  -3.19474 2.116449 1.304942
C  -1.861092 -2.389451 -0.749337
C  -6.775383 -1.151254 -0.276393
H  4.268873 0.894783 -0.713655
H  2.041364 0.225552 -1.659221
H  2.643063 1.630584 1.796681
H  4.420405 1.629617 1.730773
H  2.959894 2.470075 -2.143632
H  1.187597 2.506998 -1.998659
H  3.555592 3.946802 1.368447
H  4.420428 3.360057 -0.071452
H  2.304531 4.465544 -0.796528
H  1.354226 3.44538 0.312645
H  5.22227 -0.144165 1.683723
H  5.63412 -1.041917 0.205861
H  1.888359 -1.531238 -0.475327
H  2.911997 -2.683753 0.36444
H  4.231403 -2.254432 2.695929
H  4.829636 -3.185836 1.288082
H  5.98859 -2.350518 2.351307
H  3.719249 -1.243453 -2.275341
H  4.706357 -2.463825 -1.420935
H  3.130814 -2.921299 -2.12583
H  -0.914991 0.611005 1.353136
H  -5.706236 1.12175 0.864937
H  -4.561857 -2.653071 -0.929066
H  -2.47493 2.669259 0.673199
H  -4.085939 2.750756 1.445149
H  -2.724255 1.992138 2.301527
H  -1.377708 -2.087515 -1.696192
H  -1.057693 -2.463958 0.007559
H  -2.308234 -3.389373 -0.881625
H  -7.135515 -0.799203 -1.26293
H  -7.415308 -0.682964 0.492289
H  -6.939486 -2.242787 -0.239475
