program: Gaussian 09
title: 000029836
version: EM64L-G09RevD.01
frameworkgroup: C1[X(C8H12Cl2O4)]
method: RPBEPBE
basis: SDD
operation: Freq
keyword: #p
keyword: freq=noraman
keyword: PBEPBE/SDD
title: #p freq=noraman PBEPBE/SDD
converged: YES YES NO NO
title: Mulliken charges:
elementType: Cl Cl O O O O C C C C C C C C H H H H H H H H H H H H
charge: -0.055500 -0.055493 -0.254916 -0.255103 -0.227120 -0.226929 -0.354567 -0.354473 -0.499880 -0.500066 0.328748 0.328559 -0.503922 -0.503906 0.268592 0.248937 0.248793 0.268864 0.316847 0.316816 0.239929 0.247806 0.245118 0.247816 0.245153 0.239897
chargesum: 0.00000
title: Mulliken charges with hydrogens summed into heavy atoms:
elementType: Cl Cl O O O O C C C C C C C C
charge: -0.055500 -0.055493 -0.254916 -0.255103 -0.227120 -0.226929 0.162962 0.163184 -0.183033 -0.183250 0.328748 0.328559 0.228930 0.228959
polarizability: 1.39869455e+02 5.56725070e-02 1.25292987e+02 4.11810989e+00 9.33245272e-03 9.12693901e+01
1716.lowfreq: -10.6380 -0.0028 -0.0027 -0.0019 0.5765 9.6346 19.5739 27.9830 38.6190
frequency: 19.4391 27.9090 38.5957 53.7751 99.5657 101.6070 111.4311 113.8567 122.5005 130.5889 149.1945 210.9029 226.0405 239.0866 240.8697 266.1143 292.7904 328.4922 333.9710 446.3212 504.9693 602.0161 626.4820 661.5353 706.2001 719.6617 731.3513 774.1802 825.8155 841.7299 926.9208 928.0930 969.3837 1030.0366 1081.4504 1108.6898 1114.1741 1114.8776 1120.1904 1148.9203 1150.8462 1151.0813 1176.1588 1177.5027 1222.2561 1282.9736 1292.0425 1331.8480 1348.8410 1381.6655 1422.8642 1422.9679 1451.5893 1453.7456 1453.9147 1461.7428 1461.8095 1463.2582 1638.8946 1639.9324 2994.8873 3002.9625 3008.8355 3008.9317 3052.1259 3072.5637 3106.3091 3106.7797 3112.6477 3112.7744 3157.0908 3157.1410
redmass: 5.2911 6.4188 8.7507 8.0543 1.5336 1.4434 2.1431 2.6040 5.6762 4.0375 5.3727 4.8286 6.0369 2.5264 7.4666 3.2060 3.5008 5.4868 5.6551 6.4792 6.6171 6.6555 3.7284 5.2112 5.7447 5.9280 6.7977 2.0432 4.8422 2.3205 5.3606 6.7088 3.0769 2.0320 2.3686 2.9739 1.2934 1.3431 2.6389 1.6182 1.6491 1.4709 1.1977 1.3275 1.2563 1.6314 1.1691 1.9083 1.4404 1.4722 1.1903 1.1910 1.0693 1.0494 1.0494 1.0502 1.0504 1.0848 9.0959 9.0197 1.0608 1.0609 1.0295 1.0295 1.0972 1.1022 1.0876 1.0876 1.1048 1.1048 1.1050 1.1050
irintensity: 0.0495 2.9657 2.4799 0.0024 1.1221 0.3825 0.6025 1.5491 1.5109 0.3273 2.5134 0.0954 12.3332 12.6262 1.5473 16.9113 1.8204 8.1483 24.3501 30.4061 22.0189 21.5229 29.0178 12.5212 0.0435 4.0090 10.5877 14.1525 22.3781 19.8318 19.7584 3.3384 9.1105 14.3922 65.6231 67.1782 16.9620 6.1119 407.5475 4.2866 33.6777 35.5725 17.5027 68.8509 1.5519 11.7496 9.0637 28.2825 38.1091 1.2715 12.3324 16.6119 0.6110 17.5248 16.8454 3.2115 21.9544 33.0197 321.0964 26.9960 3.6960 35.0591 24.0761 27.0352 11.1829 1.8093 3.7691 3.1994 22.1373 21.5333 18.5944 9.7793
temp: 298.150 k
press: 1.00000 atm
elementType: 17 17 8 8 8 8 6 6 6 6 6 6 6 6 1 1 1 1 1 1 1 1 1 1 1 1
symmnumber: 1
zpe: 510618.3 jmol-1
zpe.correction: 0.194484 hartree
zpe.thermalcorrener: 0.211386 hartree
zpe.thermalcorrenthalpy: 0.212330 hartree
zpe.thermalcorrgfe: 0.146345 hartree
zpe.sumelectzpe: -1531.957301 hartree
zpe.sumelectthermal: -1531.940399 hartree
zpe.sumelectthermalent: -1531.939455 hartree
zpe.sumelectthermalfe: -1532.005441 hartree
dipole: 0.0070 -3.3774 -0.0050
dipole: 3.3774
quadrupole: -79.2969 -95.1958 -97.7088
quadrupole: -0.0123 3.8593 0.0069
quadrupole: 11.4370 -4.4620 -6.9750 -0.0123 3.8593 0.0069
hfenergy: -1532.1517851 hartree
pointgroup: C01 [X(C8H12Cl2O4)]
dipole: 0.0257703 1.3284667 0.0117312 debye
dipolederiv: -0.3761603 0.1067443 -0.0485362 0.1674826 -0.4859524 0.0646415 -0.1196144 0.1184252 -0.2079515 -0.3854194 -0.1091909 -0.0520141 -0.1692284 -0.4744091 -0.0667545 -0.1256848 -0.1184115 -0.2102901 -1.1456445 -0.4779184 0.3254551 -0.4395482 -0.6121545 0.0676252 0.4166315 0.1189591 -0.5251638 -1.1085447 0.4895978 0.3309242 0.4521406 -0.642024 -0.0824142 0.4203018 -0.1366627 -0.531502 -0.7030888 -0.1961016 0.1199769 0.04847 -0.5184097 -0.2558782 0.4310547 -0.09407 -0.6583428 -0.6939568 0.2006254 0.1298092 -0.0454076 -0.5272463 0.2531729 0.4322348 0.080126 -0.6577138 -0.1697864 0.0874362 0.0063915 0.1340231 -0.0718125 0.041604 -0.1120782 0.0490975 -0.0087895 -0.1764931 -0.0844766 0.0041943 -0.1297443 -0.0639035 -0.0429941 -0.1148658 -0.0461579 -0.0098907 0.4980027 -0.2947608 0.1202874 -0.2913525 0.4135487 -0.1688885 0.2076011 -0.2328849 0.2317985 0.5165226 0.2900902 0.1294744 0.2852645 0.3899257 0.166859 0.2186663 0.2276957 0.2365959 1.2015293 0.5708415 -0.5178417 0.2957997 0.7571315 0.2128459 -0.911201 0.0458247 0.8094296 1.1634409 -0.5786659 -0.5321758 -0.3029394 0.7896481 -0.1931443 -0.9167681 -0.0120904 0.8141421 0.4807845 0.1628575 -0.0177246 0.2286918 0.4277043 -0.0552438 0.0622472 0.0064082 0.2263836 0.4674065 -0.1636716 -0.018655 -0.230317 0.4404459 0.0593378 0.0581253 -0.0052747 0.2267959 0.1581458 0.0250141 -0.0412035 -0.0706018 0.0487318 0.0782627 0.018651 0.0445916 0.0612686 0.0561186 -0.0689574 -0.0323342 -0.0486409 -0.0023494 -0.0932576 0.0310407 -0.0454794 0.0359659 0.0593343 0.0674496 -0.0284901 0.0464271 -0.0078503 0.093936 0.0328504 0.0439114 0.0373684 0.1608837 -0.0276402 -0.044133 0.0681399 0.0492461 -0.0768355 0.0177055 -0.0452292 0.0600348 0.0032646 0.0303253 0.0330677 0.0327189 0.0182459 0.0257256 0.0192853 0.0166629 -0.0297113 0.0013365 -0.0302198 0.0316114 -0.0324283 0.0208701 -0.0260515 0.0181628 -0.016487 -0.0303488 -0.0268758 -0.0558607 0.0927153 -0.0287423 0.0904638 -0.009687 0.1222616 0.0161953 0.0149663 0.0361963 -0.0348785 -0.0336503 -0.0338323 0.0203878 0.072303 -0.1265931 0.010149 -0.0541877 -0.0142646 0.0928423 -0.0070003 -0.0044957 -0.0847953 0.011743 -0.0385464 -0.0340305 0.1045612 0.0374238 0.0345995 -0.0363692 0.0340593 0.0187581 -0.0706544 -0.1271389 -0.0053358 -0.0538938 -0.0176505 -0.0948822 -0.0075681 0.0024139 -0.0817377 -0.0132294 -0.0365079 0.034119 0.1050232 -0.0225054 0.058801 0.0937886 0.0316474 0.0875369 0.0069764 0.1221787 -0.0200516 0.0134518 unknown
polarizability: 138.2406002|-0.2029713|125.2940272|-9.6547079|0.4277865|92.8972043 unknown
InChI: InChI=1S/C8H12Cl2O4/c1-13-7(11)5(9)3-4-6(10)8(12)14-2/h5-6H,3-4H2,1-2H3
charge 0 multiplicity 1
26 atoms
Cl 2.525925 -2.230332 0.021612
Cl -2.59131 -2.144387 -0.057762
O  3.625413 0.817017 -1.044803
O  -3.586468 0.926994 1.056494
O  2.187636 1.163715 0.753647
O  -2.148533 1.242098 -0.74753
C  0.262556 -0.676649 -0.730885
C  -0.278842 -0.675628 0.715202
C  1.785391 -0.690803 -0.858651
C  -1.801552 -0.642172 0.843295
C  2.513854 0.513613 -0.265431
C  -2.49066 0.593363 0.267118
C  4.464174 1.942998 -0.560122
C  -4.388709 2.086145 0.588085
H  -0.109959 0.219817 -1.264067
H  -0.135002 -1.557032 -1.267933
H  0.090064 -1.574195 1.242467
H  0.12232 0.202551 1.257985
H  2.104443 -0.830458 -1.901474
H  -2.12477 -0.785603 1.884266
H  5.271122 2.028331 -1.300227
H  4.862372 1.710254 0.441455
H  3.865646 2.867734 -0.50968
H  -4.801116 1.876907 -0.412941
H  -3.758839 2.990074 0.542125
H  -5.187457 2.192348 1.334356
