program: Gaussian 09
title: 000029855
version: EM64L-G09RevD.01
frameworkgroup: C1[X(C19H26N2)]
method: RPBEPBE
basis: SDD
operation: Freq
keyword: #pfreq=noraman
keyword: PBEPBE/SDD
title: #p freq=noraman PBEPBE/SDD
converged: YES YES NO NO
title: Mulliken charges:
elementType: N N C C C C C C C C C C C C C C C C C C C H H H H H H H H H H H H H H H H H H H H H H H H H H
charge: -0.697165 -0.696388 -0.197815 -0.200458 -0.752689 0.364536 0.372308 0.541738 0.548983 -0.646398 -0.554894 0.272878 0.268661 -0.392370 -0.490348 -0.728056 -0.693660 -0.694173 -0.730223 -0.438377 -0.432526 0.180160 0.178309 0.216057 0.218111 0.233979 0.241667 0.239734 0.227997 0.207225 0.214193 0.228892 0.228111 0.206897 0.220818 0.225284 0.206318 0.226325 0.226971 0.212943 0.213771 0.206814 0.206196 0.306548 0.298571 0.297744 0.306797
chargesum: 0.00000
title: Mulliken charges with hydrogens summed into heavy atoms:
elementType: N N C C C C C C C C C C C C C C C C C C C
charge: -0.092047 -0.091847 -0.017655 -0.022149 -0.318521 0.364536 0.372308 0.541738 0.548983 -0.412418 -0.313227 0.272878 0.268661 -0.152636 -0.262351 -0.077746 -0.037834 -0.036245 -0.076537 -0.231563 -0.226329
polarizability: 2.89544715e+02 -2.08331250e+01 2.04282597e+02 1.00096881e+01 5.84558447e+00 1.79861349e+02
1716.lowfreq: -6.8820 -4.5703 -0.0002 0.0004 0.0005 3.6197 12.4648 17.7941 35.9206
frequency: 12.0292 17.5390 35.8868 65.4061 74.8226 115.2469 118.1684 129.2196 133.8966 165.6274 191.1020 215.2414 231.3994 252.4662 254.7194 263.0700 272.5624 280.4106 289.1033 291.0139 304.5725 318.8589 326.3267 347.8309 349.3926 375.7739 376.7126 400.8267 403.6888 468.4121 471.6549 484.4508 488.0601 505.3946 512.3510 547.3277 572.1754 596.6952 631.5186 700.2123 710.7616 743.6061 748.8302 780.0640 793.7227 811.4025 820.9129 857.4869 864.7106 887.5985 901.1797 917.4958 920.2708 924.7694 936.3672 937.1169 943.7989 957.6309 960.7272 965.5952 1015.8027 1017.4085 1075.5895 1078.8760 1090.1790 1093.6950 1123.6514 1124.4360 1159.1551 1161.8564 1180.8236 1186.4216 1192.8714 1226.2846 1231.8559 1277.1136 1286.8687 1293.6625 1298.0288 1304.2248 1310.9002 1317.6287 1344.6296 1345.6765 1375.7682 1377.7598 1387.6119 1389.7994 1396.2233 1396.6248 1428.9340 1429.5613 1464.0623 1464.8255 1465.8732 1471.0343 1471.4882 1482.4820 1482.8356 1491.6680 1492.4395 1507.5153 1509.6908 1581.1584 1585.4186 1623.3931 1624.1890 1639.8000 1640.4871 2920.4935 2921.7021 2953.0553 2970.9270 2972.6019 2977.7105 2977.9694 2996.1736 3064.8363 3066.1983 3070.7062 3071.0773 3075.2571 3076.7501 3080.6167 3080.7205 3102.1777 3104.2611 3121.9031 3127.2024 3135.4458 3136.1417 3571.0486 3572.8494 3710.4982 3712.7416
redmass: 3.9295 3.7609 3.9743 2.9142 2.9669 3.1184 3.0902 4.3985 3.8923 3.1063 2.2689 1.2004 1.2460 2.3912 1.3398 1.5520 1.1252 1.4360 3.3197 1.2680 2.9810 3.0260 2.4226 2.3324 1.8309 1.3171 1.4554 2.3091 2.3031 3.5739 3.1764 3.8551 3.2906 2.8945 3.2774 3.5514 3.4842 3.3883 4.6264 4.5840 4.6374 3.3029 3.3612 3.3840 4.0726 1.5199 1.6636 3.1701 2.9292 1.4144 1.6679 1.2461 1.3123 1.7090 2.0340 1.5422 1.4236 1.4452 1.4949 1.8585 1.5783 1.5603 1.5829 1.6178 2.3292 2.2926 2.1802 2.1910 1.3222 1.2592 1.6333 1.3417 1.8144 1.9505 1.7225 1.4904 1.7506 1.4646 1.4938 2.2639 2.4577 1.7526 1.7007 1.6924 1.2097 1.2088 3.0916 3.0161 1.2723 1.3244 3.5221 3.3182 1.0813 1.0932 1.0533 1.0659 1.0729 1.0575 1.0574 1.0594 1.0579 2.9495 2.8968 6.7935 6.7098 2.2717 2.2510 1.7236 1.7415 1.0819 1.0819 1.0595 1.0350 1.0350 1.0356 1.0357 1.1001 1.1000 1.0999 1.0993 1.0993 1.0998 1.1001 1.0995 1.0998 1.0863 1.0872 1.0896 1.0958 1.0957 1.0907 1.0449 1.0448 1.1033 1.1032
irintensity: 0.1211 0.3244 0.9630 1.2642 0.6483 0.0995 0.0674 0.7109 0.1572 0.3492 0.0627 0.5038 1.4711 21.8433 2.6397 100.3259 32.1243 128.4459 15.3217 180.6198 0.8909 7.4443 6.4655 4.4861 5.4909 16.3128 15.9546 1.1006 0.6262 3.7361 5.3849 4.6329 3.5483 6.8692 3.9891 1.2776 0.3434 6.5147 5.2417 4.7866 1.2638 0.2269 2.6261 4.0949 9.6036 57.5444 29.7758 0.2700 0.3711 9.9271 1.5674 3.3019 3.7138 2.5430 5.4021 2.8962 2.7610 0.3157 1.8117 16.1967 6.1873 2.4679 5.3628 7.8575 9.2086 7.0107 3.0121 8.9241 32.7277 14.7674 10.4648 4.5841 9.5254 0.5822 1.3076 14.9415 11.7586 0.8441 10.9754 7.3924 75.3520 15.5730 36.7051 16.9220 16.4645 16.1988 6.6544 0.8203 15.3254 15.9705 7.8144 21.5987 23.5879 3.4687 6.8638 7.3029 17.2588 9.7675 7.0348 9.3130 11.7577 234.8965 39.8394 1.8501 4.4626 22.2504 3.8825 314.5986 82.2738 41.0806 38.3317 46.3051 38.6420 39.0282 26.2121 33.4894 18.2293 4.5109 1.5428 101.0003 67.3325 37.5483 32.5495 35.6305 39.0252 24.0129 24.7388 18.6494 43.2511 13.0702 6.3778 51.7760 46.9547 18.0265 18.2542
temp: 298.150 k
press: 1.00000 atm
elementType: 7 7 6 6 6 6 6 6 6 6 6 6 6 6 6 6 6 6 6 6 6 1 1 1 1 1 1 1 1 1 1 1 1 1 1 1 1 1 1 1 1 1 1 1 1 1 1
symmnumber: 1
zpe: 1061473.8 jmol-1
zpe.correction: 0.404294 hartree
zpe.thermalcorrener: 0.426829 hartree
zpe.thermalcorrenthalpy: 0.427774 hartree
zpe.thermalcorrgfe: 0.352166 hartree
zpe.sumelectzpe: -847.577717 hartree
zpe.sumelectthermal: -847.555181 hartree
zpe.sumelectthermalent: -847.554237 hartree
zpe.sumelectthermalfe: -847.629845 hartree
dipole: 0.0774 1.6153 0.9375
dipole: 1.8693
quadrupole: -93.9294 -126.0077 -123.6180
quadrupole: -3.1614 -2.9773 1.1346
quadrupole: 20.5890 -11.4893 -9.0997 -3.1614 -2.9773 1.1346
hfenergy: -847.9820108 hartree
pointgroup: C01 [X(C19H26N2)]
dipole: 0.0576956 0.3892723 0.6212809 debye
polarizability: 277.9116479|-38.9431468|205.557203|8.0116841|10.5037713|190.2198098 unknown
InChI: InChI=1S/C19H26N2/c1-12(2)16-10-14(5-7-18(16)20)9-15-6-8-19(21)17(11-15)13(3)4/h5-8,10-13H,9,20-21H2,1-4H3
charge 0 multiplicity 1
47 atoms
N  -4.30598 0.51498 1.928921
N  5.393148 -0.91169 0.457039
C  -4.23749 1.592433 -0.799595
C  3.658827 1.427398 0.80053
C  -0.031301 -1.268971 -1.556943
C  -3.200173 0.585581 -0.285335
C  3.181424 0.145459 0.105573
C  -1.138879 -0.770741 -0.628631
C  1.387467 -1.182484 -0.993955
C  -2.130485 0.127509 -1.091418
C  1.865965 0.006892 -0.388441
C  -3.277717 0.108453 1.064579
C  4.073346 -0.974335 -0.01562
C  -1.233977 -1.221206 0.711793
C  2.282488 -2.273113 -1.096576
C  -4.365659 1.640667 -2.339599
C  -3.941384 3.019262 -0.246914
C  3.667738 1.238185 2.347508
C  2.846914 2.689471 0.428807
C  -2.284284 -0.792701 1.542573
C  3.604289 -2.173083 -0.61866
H  -5.236047 1.280648 -0.41688
H  4.705566 1.625944 0.475892
H  -0.227112 -2.325056 -1.835494
H  -0.088223 -0.693199 -2.504015
H  -2.064956 0.4785 -2.12852
H  1.172668 0.85068 -0.297461
H  -0.473861 -1.906249 1.106219
H  1.945973 -3.211523 -1.555795
H  -3.446845 2.038785 -2.808709
H  -5.198223 2.307502 -2.630831
H  -4.560556 0.638578 -2.762364
H  -3.835583 3.021344 0.853026
H  -4.746907 3.726223 -0.522929
H  -2.993009 3.396498 -0.671914
H  2.632391 1.111256 2.713301
H  4.106533 2.120001 2.852213
H  4.238955 0.341559 2.649543
H  2.802928 2.835338 -0.665604
H  3.311103 3.586001 0.879964
H  1.810495 2.629001 0.808836
H  -2.344956 -1.154539 2.577538
H  4.284313 -3.030443 -0.707348
H  -5.061879 1.111716 1.611046
H  -4.371864 0.114951 2.860046
H  6.022562 -1.694513 0.307915
H  5.775057 -0.058868 0.85099
