program: Gaussian 09
title: 000029827
version: EM64L-G09RevD.01
frameworkgroup: C1[X(C14H25N)]
method: RPBEPBE
basis: SDD
operation: Freq
keyword: #pfreq=noraman
keyword: PBEPBE/SDD
title: #p freq=noraman PBEPBE/SDD
converged: NO YES NO NO
title: Mulliken charges:
elementType: N C C C C C C C C C C C C C C H H H H H H H H H H H H H H H H H H H H H H H H H
charge: -0.317860 0.526806 -0.114686 -0.097935 -0.098421 -0.564446 -0.559296 -0.540195 -0.452176 -0.448963 -0.449621 -0.543956 -0.049541 -0.728679 -0.630162 0.189876 0.188718 0.189043 0.194477 0.217848 0.175839 0.257699 0.197540 0.191367 0.190004 0.194093 0.188815 0.193021 0.192371 0.188721 0.194421 0.192246 0.212387 0.218658 0.204365 0.214576 0.247939 0.222384 0.191465 0.221256
chargesum: 0.00000
title: Mulliken charges with hydrogens summed into heavy atoms:
elementType: N C C C C C C C C C C C C C C
charge: -0.069921 0.526806 0.075190 0.090783 0.090622 -0.152121 -0.125758 -0.151288 -0.068078 -0.067127 -0.068529 -0.157289 0.162847 -0.091080 0.004943
polarizability: 1.67272937e+02 -5.33731067e-01 1.41545719e+02 7.83182169e-01 -5.27822235e-01 1.32155155e+02
1716.lowfreq: -15.4863 -6.5030 -0.0005 0.0004 0.0004 19.7990 29.5370 76.8647 86.1228
frequency: 27.9860 76.8361 85.9596 125.5113 191.7402 206.4015 220.0039 247.3609 273.4724 285.1547 297.8691 334.1117 350.8612 393.0965 395.7188 416.5571 423.8738 426.6041 442.5688 507.4941 599.0329 625.1690 640.2563 641.0035 705.2925 767.3242 789.0343 804.5379 825.3824 860.6629 870.1241 871.7364 873.4612 894.7811 936.3523 938.1990 950.8066 967.3411 969.4149 983.0082 1010.7527 1037.8875 1047.2307 1048.3611 1054.9043 1086.4234 1096.4141 1099.1381 1102.7373 1105.3837 1110.2238 1122.2722 1126.0454 1137.7106 1163.3770 1183.4085 1193.8139 1234.9794 1256.1316 1275.3440 1284.9525 1290.3435 1293.6711 1302.9737 1307.4516 1311.6258 1317.0380 1323.8779 1336.0826 1338.3637 1345.0851 1347.6001 1354.8613 1360.1785 1364.2223 1374.8329 1430.7556 1434.8796 1448.2282 1449.1011 1454.0040 1461.7612 1462.1992 1463.3206 1467.6600 1471.9288 1483.0080 1483.8722 1498.0603 2884.1432 2930.7789 2943.3072 2947.3378 2952.9492 2955.6381 2956.9015 2959.9029 2964.9311 2976.9543 2984.4474 2985.3819 2995.3775 2998.5583 3002.3721 3008.2336 3013.5559 3014.5055 3021.4974 3023.8050 3037.1201 3060.0679 3066.1661 3071.6793 3436.2041
redmass: 3.1839 2.3174 2.6598 2.3727 2.5649 1.1233 1.4667 2.1944 2.5947 2.1662 1.9835 2.3722 1.9862 4.5142 4.6363 1.8331 1.8159 1.7065 1.7962 2.4950 2.8210 1.8730 3.8172 3.5110 3.8124 3.4640 2.3620 2.7654 2.1157 1.7428 1.5788 1.5723 1.5489 2.3065 1.8814 2.3994 1.9897 2.1418 2.1035 2.5525 1.7321 1.9276 1.7371 1.7548 1.9752 1.9156 1.4817 1.4586 1.3726 1.1046 1.0187 1.2976 1.5453 2.6166 2.3335 1.2393 1.2060 1.6755 1.6286 1.6988 1.8226 1.8482 1.6923 2.2187 1.7197 1.5199 1.3622 1.3142 1.4080 1.3638 1.4122 1.4712 1.4384 1.5845 1.5619 1.2273 1.1244 1.1494 1.0848 1.1025 1.0828 1.0898 1.0916 1.0625 1.0878 1.0986 1.0591 1.0881 1.0413 1.0542 1.0617 1.0605 1.0634 1.0648 1.0627 1.0611 1.0617 1.0373 1.0830 1.0834 1.0834 1.0974 1.0831 1.1006 1.0759 1.1018 1.1023 1.1005 1.1019 1.0970 1.0991 1.0997 1.0985 1.0742
irintensity: 0.1215 1.2940 0.2135 0.1846 0.7787 0.3716 0.6666 0.4121 3.7760 0.0665 0.0137 0.2719 0.0346 0.0587 0.0159 0.9891 0.2199 0.2191 3.8478 10.8924 21.6684 105.9822 0.0120 8.4332 3.1398 3.5085 1.3188 2.8439 6.6684 6.3786 0.1832 0.1554 0.1192 0.2057 3.0318 0.2069 3.0190 7.2949 4.8110 9.8740 8.5680 1.0757 1.4405 0.7450 10.8526 2.5398 1.8820 5.6426 5.8647 0.7321 0.1552 0.9906 7.0481 5.2955 35.6021 4.8674 4.3866 1.0736 3.8998 0.0863 0.1638 0.5171 1.0345 8.1981 1.4895 0.7699 2.6310 0.0344 4.1544 1.7690 3.2881 8.4300 4.3582 2.1070 1.7991 17.0862 2.2851 18.9486 0.8262 4.3011 3.4130 16.8132 16.4018 4.2480 15.6210 5.1695 12.3392 0.1017 10.9146 161.2562 14.8970 19.2873 38.2448 52.5349 45.4183 22.0821 24.9000 40.3095 18.2948 169.2211 156.2990 16.5995 60.6959 51.5172 43.7385 25.6854 25.0909 60.9229 94.4246 26.9983 45.1219 49.3167 41.2354 1.0157
temp: 298.150 k
press: 1.00000 atm
elementType: 7 6 6 6 6 6 6 6 6 6 6 6 6 6 6 1 1 1 1 1 1 1 1 1 1 1 1 1 1 1 1 1 1 1 1 1 1 1 1 1
symmnumber: 1
zpe: 958139.4 jmol-1
zpe.correction: 0.364936 hartree
zpe.thermalcorrener: 0.379341 hartree
zpe.thermalcorrenthalpy: 0.380285 hartree
zpe.thermalcorrgfe: 0.324443 hartree
zpe.sumelectzpe: -602.032876 hartree
zpe.sumelectthermal: -602.018472 hartree
zpe.sumelectthermalent: -602.017528 hartree
zpe.sumelectthermalfe: -602.073369 hartree
dipole: 1.1230 -0.2350 -0.1898
dipole: 1.1630
quadrupole: -91.6289 -95.1045 -92.9514
quadrupole: 1.0807 -1.1295 -0.2615
quadrupole: 1.5994 -1.8762 0.2769 1.0807 -1.1295 -0.2615
hfenergy: -602.3978125 hartree
pointgroup: C01 [X(C14H25N1)]
dipole: 0.4430026 0.0865083 0.074924 debye
polarizability: 167.2068518|0.8606593|141.5470663|-1.5450298|0.5939864|132.2198926 unknown
InChI: InChI=1S/C14H25N/c1-10(15-2)6-14-7-11-3-12(8-14)5-13(4-11)9-14/h10-13,15H,3-9H2,1-2H3
charge 0 multiplicity 1
40 atoms
N  2.882964 -0.871587 0.252828
C  -0.007657 0.490413 0.221712
C  -1.680435 -0.420044 -1.48781
C  -1.651187 -1.36876 0.864028
C  -2.521037 0.974784 0.453962
C  -0.245646 0.135997 -1.276097
C  -0.220104 -0.801836 1.070547
C  -1.087822 1.533334 0.654305
C  -1.860707 -1.707196 -0.637363
C  -2.727132 0.639237 -1.048214
C  -2.700088 -0.312618 1.303255
C  1.394246 1.130266 0.45252
C  2.635543 0.508396 -0.239389
C  3.854723 1.463207 -0.074117
C  3.931534 -1.644179 -0.437703
H  -1.824805 -0.661072 -2.560421
H  -1.77124 -2.288277 1.471653
H  -3.261407 1.736766 0.770975
H  -0.09172 1.037898 -1.905994
H  0.493296 -0.62393 -1.597522
H  -0.065147 -0.563617 2.144845
H  0.543624 -1.547295 0.783099
H  -0.931438 1.80642 1.719115
H  -0.964233 2.462574 0.059086
H  -2.874828 -2.127749 -0.795243
H  -1.130294 -2.477537 -0.956807
H  -2.617919 1.55796 -1.660112
H  -3.752671 0.252394 -1.216427
H  -3.726286 -0.713701 1.175155
H  -2.573157 -0.077165 2.37978
H  1.587379 1.173564 1.548089
H  1.343721 2.186798 0.113623
H  2.426507 0.417989 -1.325027
H  4.767732 1.036038 -0.527822
H  4.059405 1.653545 0.997791
H  3.663348 2.438153 -0.560909
H  2.990119 -0.889122 1.276619
H  3.95539 -2.672712 -0.033908
H  4.964674 -1.226914 -0.364602
H  3.679953 -1.716122 -1.512699
