program: Gaussian 09
title: 000032969
version: EM64L-G09RevD.01
frameworkgroup: C1[X(C18H24O3S)]
method: RPBEPBE
basis: SDD
operation: Freq
keyword: #p
keyword: freq=noraman
keyword: PBEPBE/SDD
title: #p freq=noraman PBEPBE/SDD
converged: YES YES NO NO
title: Mulliken charges:
elementType: S O O O C C C C C C C C C C C C C C C C C C H H H H H H H H H H H H H H H H H H H H H H H H
charge: 0.954429 -0.563196 -0.507028 -0.506273 0.401759 0.469511 0.567366 -0.568335 0.543591 -0.267397 -0.568025 -0.694986 -0.358219 -0.677111 -0.451484 -0.359812 -0.373245 -0.414764 -0.340254 -0.340863 -0.694407 -0.694473 0.210932 0.212163 0.207243 0.209818 0.252242 0.206933 0.212812 0.250059 0.298567 0.206715 0.208726 0.275931 0.240086 0.195596 0.197973 0.195471 0.196929 0.211302 0.214403 0.218542 0.211959 0.212108 0.218226 0.378478
chargesum: 0.00000
title: Mulliken charges with hydrogens summed into heavy atoms:
elementType: S O O O C C C C C C C C C C C C C C C C C C
charge: 0.954429 -0.184718 -0.507028 -0.506273 0.401759 0.469511 0.567366 -0.145240 0.543591 -0.267397 -0.150964 -0.442743 0.061525 -0.427052 -0.152917 0.055628 -0.097313 -0.174678 0.053316 0.051537 -0.050160 -0.052180
polarizability: 3.40326592e+02 -3.46488049e+00 2.44814332e+02 2.63180890e+00 1.64897398e+01 1.59054155e+02
1716.lowfreq: -8.8317 -1.5821 -0.0005 0.0011 0.0015 3.8248 11.1056 17.4106 34.3529
frequency: 9.9750 17.0483 34.2882 37.1014 56.0983 58.0745 64.0941 88.8056 106.1676 107.2569 119.8589 131.6193 150.5595 168.5486 195.5410 208.7283 216.8724 222.4685 231.4097 234.8733 253.5026 259.9492 287.0210 300.3546 315.2763 329.2681 340.3702 390.8371 398.8479 419.9218 451.9634 471.9828 495.0262 520.2198 529.2576 575.3101 609.8887 650.0135 662.6533 715.0722 732.0042 732.1610 775.4660 785.9953 788.9226 791.7056 804.6583 837.2960 843.0347 875.9664 892.9499 904.5165 918.0623 923.7567 925.4541 943.3587 946.5678 959.8982 975.9581 980.7977 1012.4073 1017.5974 1048.9414 1068.2883 1071.2176 1080.6502 1090.4073 1105.6926 1106.0391 1136.7410 1185.9877 1190.2716 1204.6855 1206.6599 1210.7687 1254.0105 1255.7004 1261.3704 1273.0508 1276.2111 1284.4408 1287.9916 1288.8711 1319.7512 1321.4856 1341.4626 1348.1896 1348.7651 1389.3478 1389.6031 1401.5396 1419.6588 1430.1954 1447.0224 1464.1983 1465.5186 1468.7611 1469.6627 1477.2144 1477.8245 1479.3642 1480.2114 1487.8236 1488.8025 1507.5231 1563.1264 1614.3175 1640.4051 2963.7129 2963.9991 2969.2697 2970.6686 2974.0345 2974.6298 2978.1050 2980.7348 3003.1437 3003.8755 3022.4362 3023.9700 3046.8771 3048.6270 3071.0423 3071.8432 3073.5684 3074.1396 3117.5008 3122.0501 3128.7811 3141.4040 3168.3973 3478.3793
redmass: 3.2635 2.9729 5.0533 7.4955 4.0950 1.6974 1.7716 4.2246 2.7174 2.4438 4.1791 4.1577 4.8269 1.8467 2.7562 3.1895 3.6153 2.1984 1.2648 1.3071 4.2434 3.3501 4.3878 4.3174 4.2866 8.4676 3.6778 3.0417 3.1901 9.5238 3.1636 3.6653 5.0390 5.2581 7.8284 7.0035 4.3790 5.1180 3.0784 4.8557 1.0784 1.0755 3.1632 1.9421 1.2564 1.6915 4.3337 5.2246 2.0865 1.4877 1.7378 1.6476 1.3478 1.3466 1.4305 4.0642 2.0076 3.8341 1.8163 2.4113 3.9690 3.3530 1.1665 2.5708 2.6007 1.3887 1.4377 2.1417 2.1748 1.9359 1.4159 1.4860 1.5770 1.4668 2.1162 1.3185 1.3508 2.0452 1.2359 1.4294 1.5238 1.0783 1.0789 1.4075 1.4192 1.5530 1.5528 1.5501 1.2120 1.2105 4.1875 4.8477 3.9024 3.4592 1.0823 1.0814 1.0762 1.0791 1.0426 1.0422 1.0751 1.0771 1.0879 1.0913 3.4373 7.3166 6.3326 7.0120 1.0586 1.0587 1.0597 1.0591 1.0363 1.0369 1.0599 1.0597 1.0985 1.0991 1.1014 1.1020 1.1042 1.1044 1.1007 1.1008 1.0994 1.0994 1.0916 1.0912 1.0896 1.0918 1.0955 1.0661
irintensity: 0.1053 0.1675 0.0666 0.2289 0.0693 0.0305 0.0712 0.2882 0.1262 0.3061 0.7249 0.7881 0.4057 42.1406 3.8539 1.3294 2.3064 18.3572 2.0300 0.4027 0.8768 16.9524 11.8152 11.7498 21.7249 7.7012 2.1029 0.6563 0.8837 75.5467 8.3803 7.9494 4.5524 43.3458 78.2441 42.4795 5.8939 2.8128 1.6541 5.2725 4.8838 10.2948 0.2524 1.0769 1.8647 2.3409 9.2497 30.5714 70.6196 4.0106 3.2857 4.5486 2.2765 8.9093 8.5396 44.8323 29.3644 24.1319 5.5432 10.8440 3.4932 0.9244 76.6877 2.9296 4.2360 6.6649 1.3458 34.4108 13.0611 4.8085 0.2852 3.0844 1.7290 0.8378 5.2621 0.3071 5.2167 7.9665 1.3895 7.9743 6.9659 3.2161 0.8914 1.4491 2.2184 6.8253 1.3109 0.4570 10.9800 12.5210 17.2629 1.3259 2.1684 15.2064 0.2929 0.1154 0.6248 1.2760 12.8390 12.8877 4.3219 2.7859 19.1689 20.1848 47.1455 2.5789 9.5801 31.7163 14.3031 15.0484 1.6361 5.7731 36.8607 38.1267 88.7972 85.9174 3.3585 2.7657 2.1069 3.3080 34.6228 35.1870 76.0286 80.1768 57.4076 54.8349 5.4220 21.1066 12.3942 7.8458 3.6997 38.9438
temp: 298.150 k
press: 1.00000 atm
elementType: 16 8 8 8 6 6 6 6 6 6 6 6 6 6 6 6 6 6 6 6 6 6 1 1 1 1 1 1 1 1 1 1 1 1 1 1 1 1 1 1 1 1 1 1 1 1
symmnumber: 1
zpe: 988747.2 jmol-1
zpe.correction: 0.376594 hartree
zpe.thermalcorrener: 0.401087 hartree
zpe.thermalcorrenthalpy: 0.402032 hartree
zpe.thermalcorrgfe: 0.318902 hartree
zpe.sumelectzpe: -1322.234064 hartree
zpe.sumelectthermal: -1322.209570 hartree
zpe.sumelectthermalent: -1322.208626 hartree
zpe.sumelectthermalfe: -1322.291755 hartree
dipole: -2.3716 -5.0391 0.2801
dipole: 5.5763
quadrupole: -128.9899 -145.5127 -142.6832
quadrupole: -10.8987 0.4538 11.3428
quadrupole: 10.0720 -6.4507 -3.6213 -10.8987 0.4538 11.3428
hfenergy: -1322.6106577 hartree
pointgroup: C01 [X(C18H24O3S1)]
dipole: 0.9273964 -1.9851574 0.1108861 debye
polarizability: 340.3093583|3.6409396|240.246045|3.3143204|-25.3091878|163.6396754 unknown
InChI: InChI=1S/C18H24O3S/c1-3-5-7-14-9-10-17-16(11-14)12-15(8-6-4-2)13-18(17)22(19,20)21/h9-13,19H,3-8H2,1-2H3
charge 0 multiplicity 1
46 atoms
S  -1.625765 2.972631 -0.674252
O  -1.066714 2.641129 -2.420529
O  -3.231096 3.179609 -0.662574
O  -0.680449 4.14923 -0.083549
C  0.317198 -0.488078 0.725017
C  0.144863 0.854494 0.193707
C  -2.141189 -0.848339 0.786536
C  -3.35418 -1.723404 1.051438
C  2.774939 -0.193852 0.686883
C  -1.211424 1.256642 -0.008855
C  4.183654 -0.721491 0.900438
C  -0.833415 -1.294949 1.007486
C  -3.967486 -2.312097 -0.250192
C  1.645478 -0.97265 0.958358
C  -2.324125 0.471613 0.257086
C  4.90119 -1.08063 -0.431201
C  1.307438 1.648063 -0.074326
C  2.579162 1.130793 0.166051
C  -5.228358 -3.16291 0.021034
C  6.347928 -1.577824 -0.212588
C  -5.832915 -3.75878 -1.268283
C  7.065533 -1.924558 -1.534655
H  -3.075963 -2.556092 1.725782
H  -4.136342 -1.13615 1.572847
H  4.79268 0.038155 1.431243
H  4.158765 -1.619644 1.547363
H  -0.673297 -2.301567 1.414127
H  -3.20434 -2.927791 -0.767324
H  -4.223518 -1.485775 -0.943853
H  1.7670 -1.985902 1.361981
H  -3.33003 0.866759 0.075052
H  4.913461 -0.192005 -1.094354
H  4.315147 -1.856927 -0.962873
H  1.190563 2.667231 -0.452337
H  3.459005 1.753274 -0.037162
H  -4.973858 -3.98138 0.725293
H  -5.987243 -2.536395 0.532829
H  6.922784 -0.79902 0.329343
H  6.333207 -2.469079 0.447611
H  -5.104843 -4.414061 -1.782291
H  -6.123069 -2.959967 -1.976409
H  -6.734234 -4.360414 -1.050476
H  7.12225 -1.041174 -2.198242
H  6.526689 -2.720425 -2.082412
H  8.097152 -2.277871 -1.353643
H  -1.148136 3.504177 -2.922525
