program: Gaussian 09
title: 000029830
version: EM64L-G09RevD.01
frameworkgroup: C1[X(C4H5N5O10)]
method: RPBEPBE
basis: SDD
operation: Freq
keyword: #p
keyword: freq=noraman
keyword: PBEPBE/SDD
title: #p freq=noraman PBEPBE/SDD
converged: YES YES NO NO
title: Mulliken charges:
elementType: O O O O O O O O O O N N N N N C C C C H H H H H
charge: -0.183379 -0.116762 -0.147876 -0.101746 -0.133574 -0.126478 -0.176218 -0.183566 -0.402012 -0.213698 -0.005452 0.125507 0.110410 0.124798 0.161163 0.364650 -0.468664 -0.467368 0.247895 0.322616 0.286322 0.282054 0.304098 0.397281
chargesum: 0.00000
title: Mulliken charges with hydrogens summed into heavy atoms:
elementType: O O O O O O O O O O N N N N N C C C C
charge: -0.183379 -0.116762 -0.147876 -0.101746 -0.133574 -0.126478 -0.176218 -0.183566 -0.004731 -0.213698 -0.005452 0.125507 0.110410 0.124798 0.161163 0.364650 0.140274 0.118784 0.247895
polarizability: 1.51884018e+02 3.21739755e+00 1.20507987e+02 -6.88501888e-01 1.91241279e+00 1.00282171e+02
1716.lowfreq: -11.3669 -8.1238 -0.0008 0.0006 0.0008 2.3770 5.4931 34.4201 48.8298
frequency: 1.6818 34.3699 48.7446 60.5684 79.5615 80.9018 90.7638 104.6875 112.6456 138.4778 148.8647 163.7713 192.8787 201.8231 242.5352 310.8076 327.7807 338.9522 347.6715 354.1095 377.5068 408.0291 475.8266 487.9925 538.9428 552.1284 562.5514 618.8429 639.2442 649.0628 660.4708 674.6807 700.5230 718.0983 755.6250 764.6491 800.9269 845.0557 855.9079 928.1086 954.3170 1050.9338 1063.1308 1091.1046 1148.4775 1153.1504 1161.5159 1210.9379 1224.0729 1273.6931 1319.6878 1343.1790 1364.6781 1380.1196 1404.1558 1421.2434 1436.9326 1445.0261 1449.0869 1453.6729 1680.8122 3022.2924 3034.5365 3085.9732 3101.8025 3524.9164
redmass: 13.5865 9.6002 7.4100 13.0932 12.4328 13.1455 11.5758 14.9148 12.5125 13.6650 13.3754 11.9486 12.0127 11.5620 8.3214 7.8576 12.5524 3.7277 6.4740 14.1420 5.7568 2.2647 2.1831 7.4564 6.8449 7.9498 5.6723 3.3757 2.9252 2.9214 6.7082 11.4013 9.3899 14.4955 8.4355 8.8874 8.9650 4.4715 8.5883 3.6713 2.5035 8.9388 2.5399 2.9458 9.6638 14.4104 11.7753 6.4421 1.8777 1.6332 2.3499 1.3233 1.5675 1.2523 1.2243 1.2509 8.4241 10.8412 6.5232 6.4343 9.2372 1.0588 1.0591 1.1027 1.1027 1.0644
irintensity: 0.5685 0.5679 1.9993 0.7162 1.6400 0.4567 1.6449 0.8344 1.2059 0.1313 0.9531 3.7653 5.6456 2.1837 1.3901 1.7799 0.9830 1.8973 0.7120 0.8214 6.4350 5.1656 24.2080 11.1446 3.0881 6.2438 45.6840 44.0692 39.3706 38.7233 25.2126 19.8470 15.0495 60.4901 50.7922 51.2772 53.1443 11.6663 26.0661 71.7592 9.4062 20.7177 330.1492 77.0566 150.0512 85.1678 241.6143 8.2548 7.9279 13.3457 5.9462 3.0020 40.1749 26.8403 90.1708 106.8471 189.6790 195.0623 63.4563 42.2973 222.1264 7.2319 1.9502 8.7814 0.8556 56.4155
temp: 298.150 k
press: 1.00000 atm
elementType: 8 8 8 8 8 8 8 8 8 8 7 7 7 7 7 6 6 6 6 1 1 1 1 1
symmnumber: 1
zpe: 354066.0 jmol-1
zpe.correction: 0.134857 hartree
zpe.thermalcorrener: 0.153646 hartree
zpe.thermalcorrenthalpy: 0.154591 hartree
zpe.thermalcorrgfe: 0.083300 hartree
zpe.sumelectzpe: -1179.562328 hartree
zpe.sumelectthermal: -1179.543538 hartree
zpe.sumelectthermalent: -1179.542594 hartree
zpe.sumelectthermalfe: -1179.613885 hartree
dipole: -2.7970 -2.0555 -4.3801
dipole: 5.5887
quadrupole: -112.7620 -117.9907 -107.7421
quadrupole: 10.9809 0.6614 -3.9239
quadrupole: 0.0696 -5.1591 5.0895 10.9809 0.6614 -3.9239
hfenergy: -1179.6971847 hartree
pointgroup: C01 [X(C4H5N5O10)]
dipole: -1.0981745 1.1133572 1.5456415 debye
dipolederiv: -0.3412548 0.1145332 0.1790185 0.1949685 -0.5127768 -0.1754751 0.1915245 -0.0044767 -0.5526563 -0.6134974 -0.0545685 -0.0006274 -0.1415774 -0.2105508 -0.1725978 -0.1457112 -0.1858385 -0.3120999 -0.4522883 0.0643698 -0.1957159 -0.0323636 -0.4897424 0.2303688 -0.1700225 0.2369403 -0.3760986 -0.1692875 0.0842463 0.1128158 0.0474136 -0.3778853 0.1352009 0.1353943 0.0792654 -0.5546726 -0.6807678 0.060306 0.1064222 0.1108243 -0.2205208 -0.1876037 0.1516983 -0.1800339 -0.336535 -0.5253741 -0.2383451 -0.1037658 -0.2724309 -0.5688174 0.1076138 -0.1420537 0.094761 -0.2061333 -0.9067391 -0.2100178 -0.0764914 -0.0754419 -0.4401148 -0.0044491 -0.1453007 -0.049005 -0.1880399 -0.5816389 0.2744027 -0.0518862 0.1644454 -0.7712021 0.0237367 -0.0416186 -0.0121179 -0.1815713 -1.2228585 0.4013664 0.0565456 0.4542406 -0.6120857 -0.0761518 -0.0225512 0.0128589 -0.2431334 -0.8063594 0.185923 0.072941 0.145539 -0.3412875 0.0925935 0.3169255 0.0296163 -0.7174662 -0.6710432 -0.3350428 -0.0231032 -0.2948553 -0.9283648 0.0157034 -0.0634741 -0.1260415 -0.2691987 0.3398732 -0.3419836 -0.2737633 -0.4324064 1.015906 -0.0480316 -0.2477048 -0.1921403 0.9495534 1.2182371 0.0057507 -0.103518 -0.0019661 0.4164582 0.6095955 -0.0757111 0.6170807 0.731188 1.209745 0.2377088 0.5423518 0.3344991 0.8823094 -0.3749281 0.5902696 -0.3261902 0.4796235 1.3511842 0.2482337 0.1719207 0.3485018 1.8482662 0.0662204 0.2960869 0.2557748 0.2095637 -0.1891973 -0.0110442 -0.1854875 0.0458655 -0.0488965 -0.0986839 -0.1065603 -0.0891964 -0.0032438 0.6784955 0.3160863 -0.116636 0.2221582 -0.1153933 -0.0259459 -0.1598327 -0.06486 0.1167869 0.1897208 -0.1596516 -0.0381801 -0.1995175 0.2930676 -0.0089043 -0.0728511 0.0591718 -0.0425183 1.5446706 -0.5923079 -0.129577 -0.5869463 0.5344702 -0.1589145 -0.2795761 -0.2046869 0.9441268 0.0810985 -0.0094074 0.0238986 0.069029 0.1272541 0.0181125 0.0380348 0.0213042 0.1405781 0.0198911 -0.0432089 0.0475205 -0.0698932 0.0694133 -0.074626 0.0158646 -0.0581978 0.0632973 0.112181 -0.0170163 -0.0968488 0.0189524 0.0139746 -0.0161629 -0.0747982 -0.0129248 0.110537 0.0233518 0.0175263 0.047492 -0.0334721 0.0688373 0.0647844 -0.0062561 0.0288457 0.1008007 0.3918575 0.002141 0.0346738 -0.0155667 0.3676815 0.0585448 0.0182238 0.0700908 0.137312 unknown
polarizability: 152.0438756|-2.2978317|120.3135038|0.3929901|-2.1681559|100.3167972 unknown
InChI: InChI=1S/C4H5N5O10/c10-3(11)1-5(9(18)19)2-4(6(12)13,7(14)15)8(16)17/h10H,1-2H2
charge 0 multiplicity 1
24 atoms
O  0.265267 2.298796 0.495848
O  0.230732 -1.247551 -1.606896
O  3.01884 -0.715154 1.458844
O  1.023233 1.804839 -1.60664
O  2.511681 -1.076223 -1.516959
O  3.269493 1.349725 0.500308
O  -2.869184 -2.003272 0.381766
O  -0.74838 -2.844648 0.645703
O  -3.871157 1.642019 -0.10055
O  -1.982278 1.020533 -1.315894
N  -1.148644 -0.573905 0.946215
N  0.776971 1.528829 -0.394715
N  1.32601 -0.831714 -1.110585
N  2.631705 0.276489 0.749387
N  -1.615828 -1.898642 0.632851
C  1.186512 0.11428 0.133429
C  0.257058 -0.416091 1.263469
C  -2.173626 0.459578 1.091764
C  -2.630079 1.039533 -0.253326
H  0.665602 -1.393831 1.57371
H  0.361165 0.291054 2.10529
H  -1.750554 1.28427 1.691299
H  -3.053465 0.055997 1.618588
H  -4.163073 2.05649 -0.957208
