program: Gaussian 09
title: 000029816
version: EM64L-G09RevD.01
frameworkgroup: C1[X(C12H17NO)]
method: RPBEPBE
basis: SDD
operation: Freq
keyword: #p
keyword: freq=noraman
keyword: PBEPBE/SDD
title: #p freq=noraman PBEPBE/SDD
converged: NO YES NO NO
title: Mulliken charges:
elementType: O N C C C C C C C C C C C C H H H H H H H H H H H H H H H H H
charge: -0.275148 -0.076414 0.159938 -0.458908 -0.454781 0.488634 -0.749811 -0.646638 -0.556630 -0.439875 0.340949 -0.222397 -0.387544 -0.537196 0.226507 0.199820 0.197538 0.224698 0.220643 0.222505 0.242334 0.227844 0.227318 0.186758 0.259559 0.235454 0.219952 0.241451 0.219878 0.220058 0.243505
chargesum: 0.00000
title: Mulliken charges with hydrogens summed into heavy atoms:
elementType: O N C C C C C C C C C C C C
charge: -0.275148 -0.076414 0.159938 -0.032582 -0.032545 0.488634 -0.064330 -0.004718 -0.297072 -0.204421 0.340949 -0.002444 -0.146092 0.146247
polarizability: 1.81169483e+02 5.61370110e+00 1.33627250e+02 4.03294669e+00 -9.89968571e+00 9.99811762e+01
1716.lowfreq: -14.8090 -3.4788 -0.0007 -0.0006 0.0003 4.8075 22.9466 61.2112 91.5967
frequency: 22.3275 61.1997 91.5951 111.7725 144.3119 195.0640 215.0883 240.9238 249.9090 259.4262 263.1040 283.6624 293.4327 316.2457 328.5468 409.1508 425.2847 466.7376 497.1742 548.7282 618.7105 639.6780 693.8026 705.1172 784.3030 788.1683 865.2006 872.8302 892.4503 903.5688 909.0857 951.1902 954.8970 962.3603 963.8681 982.5379 1010.4650 1075.3302 1085.1178 1093.6349 1096.3846 1110.9169 1143.2206 1145.0321 1150.6310 1164.0576 1179.1893 1183.9439 1210.9297 1224.1764 1267.1599 1283.8623 1290.1666 1322.3965 1380.9058 1387.6393 1424.8085 1427.3306 1442.7205 1462.8760 1463.3467 1465.0109 1467.9870 1473.0517 1473.5630 1476.1555 1481.4857 1489.6445 1585.0436 1621.3368 2857.0608 2911.9850 2926.3552 2958.1942 2975.6498 3018.9853 3028.3651 3032.8745 3045.2340 3072.7482 3074.2680 3085.1736 3123.6920 3124.6489 3144.0425 3148.5728 3167.2916
redmass: 3.4521 3.2234 3.1792 3.3125 3.1296 1.5666 1.2422 2.1418 1.2588 1.9204 3.2660 1.6941 3.2432 3.0278 2.5863 2.5321 3.2467 2.9507 3.5735 4.5276 4.5876 4.8790 4.3324 1.8520 1.5935 4.4094 2.8312 1.4203 1.5920 2.2870 1.7873 1.8965 2.0130 2.1963 1.3276 5.8041 4.0888 1.6841 1.3125 1.1773 1.4294 1.2596 1.5339 2.0232 1.6312 1.8243 1.2121 1.8819 2.6919 4.1622 1.4503 2.0074 1.3757 2.5287 1.2080 7.6453 1.1620 1.6326 1.7252 1.0613 1.0638 1.0505 1.2384 1.0553 1.0776 1.0592 1.8926 1.1140 6.1361 6.6694 1.0555 1.0634 1.0661 1.0330 1.0345 1.0739 1.0969 1.0993 1.1039 1.0995 1.1010 1.1010 1.0881 1.0970 1.0931 1.0919 1.0961
irintensity: 0.0894 1.4257 7.4454 0.1116 0.7092 0.4669 0.2311 4.5470 0.2663 1.0252 2.3461 1.5908 0.1903 3.8634 3.6209 1.9801 0.8581 4.6101 0.3881 8.7952 1.1684 3.2605 10.8524 36.5122 43.1000 7.0852 0.5129 0.2038 18.9700 4.4577 0.6693 2.1078 4.3285 13.5809 0.5950 3.6492 89.3319 13.0413 5.7180 1.5922 8.4624 0.2216 5.5864 0.7632 9.8751 43.6127 3.6385 3.4648 67.8755 28.0600 0.8644 33.0248 8.8915 36.3929 15.8054 13.6536 1.4875 38.6755 21.4138 14.9414 12.3957 12.7834 13.4748 1.6139 16.7489 4.5259 31.8467 10.3227 66.7589 97.1374 118.2498 71.6434 85.2129 70.1606 24.6524 50.5774 43.5382 54.1033 50.8956 29.9354 23.5941 32.5064 12.2030 21.3577 23.1275 3.8016 15.1716
temp: 298.150 k
press: 1.00000 atm
elementType: 8 7 6 6 6 6 6 6 6 6 6 6 6 6 1 1 1 1 1 1 1 1 1 1 1 1 1 1 1 1 1
symmnumber: 1
zpe: 688846.3 jmol-1
zpe.correction: 0.262368 hartree
zpe.thermalcorrener: 0.276590 hartree
zpe.thermalcorrenthalpy: 0.277535 hartree
zpe.thermalcorrgfe: 0.221133 hartree
zpe.sumelectzpe: -596.328059 hartree
zpe.sumelectthermal: -596.313836 hartree
zpe.sumelectthermalent: -596.312892 hartree
zpe.sumelectthermalfe: -596.369293 hartree
dipole: -1.9568 0.5127 -1.1461
dipole: 2.3249
quadrupole: -73.1525 -82.0454 -86.4475
quadrupole: -0.1149 -0.3903 -1.0114
quadrupole: 7.3960 -1.4970 -5.8990 -0.1149 -0.3903 -1.0114
hfenergy: -596.5904267 hartree
pointgroup: C01 [X(C12H17N1O1)]
dipole: 0.7806159 0.1512998 0.4521268 debye
polarizability: 181.2575423|-5.8212994|131.2056345|1.6672267|13.3335916|102.3147325 unknown
InChI: InChI=1S/C12H17NO/c1-12(8-13(2)9-12)10-5-4-6-11(7-10)14-3/h4-7H,8-9H2,1-3H3
charge 0 multiplicity 1
31 atoms
O  3.140485 -1.390192 -0.412159
N  -3.357196 -0.561109 0.198369
C  -1.495664 0.272325 -0.501411
C  -2.111355 -1.172736 -0.388131
C  -2.600765 0.696083 0.540253
C  -0.043631 0.455096 -0.088309
C  -1.75088 0.89871 -1.894993
C  -4.048849 -1.278349 1.276339
C  0.920832 -0.529243 -0.390172
C  0.375784 1.651467 0.557203
C  2.283438 -0.332351 -0.056469
C  1.731422 1.841702 0.888698
C  2.702249 0.856894 0.587557
C  4.562248 -1.243395 -0.092019
H  -2.275499 -1.733648 -1.325719
H  -1.551119 -1.805696 0.337831
H  -2.204891 0.702791 1.581868
H  -3.155687 1.631413 0.34426
H  -1.516866 1.979271 -1.888702
H  -1.114167 0.419711 -2.661283
H  -2.810234 0.765483 -2.177581
H  -4.474398 -2.219173 0.882588
H  -4.884145 -0.662276 1.655931
H  -3.382505 -1.531958 2.13951
H  0.64131 -1.465284 -0.885544
H  -0.361589 2.424893 0.800682
H  2.045888 2.764533 1.389538
H  3.74967 1.022921 0.855154
H  4.722273 -1.147672 0.99975
H  5.003967 -0.368959 -0.60865
H  5.035172 -2.16705 -0.456389
