program: Gaussian 09
title: 000029856
version: EM64L-G09RevD.01
frameworkgroup: C1[X(C19H23NO2)]
method: RPBEPBE
basis: SDD
operation: Freq
keyword: #p
keyword: freq=noraman
keyword: PBEPBE/SDD
title: #p freq=noraman PBEPBE/SDD
converged: YES YES NO NO
title: Mulliken charges:
elementType: O O N C C C C C C C C C C C C C C C C C C C H H H H H H H H H H H H H H H H H H H H H H H
charge: -0.302058 -0.301578 -0.100612 -0.208225 -0.460294 0.346690 -0.566192 0.367436 -0.508148 -0.725042 -0.578383 -0.546424 0.449579 0.195766 0.194739 -0.371884 -0.452681 -0.230271 -0.221104 -0.245346 -0.530359 -0.530766 0.213333 0.222693 0.242798 0.224953 0.230739 0.222987 0.206495 0.232754 0.220943 0.220225 0.258038 0.256977 0.263287 0.230910 0.223990 0.223754 0.226357 0.227947 0.252860 0.220662 0.253545 0.221164 0.227744
chargesum: 0.00000
title: Mulliken charges with hydrogens summed into heavy atoms:
elementType: O O N C C C C C C C C C C C C C C C C C C C
charge: -0.302058 -0.301578 -0.100612 0.005108 0.005197 0.346690 -0.110500 0.367436 -0.078666 -0.051120 -0.320345 -0.289448 0.449579 0.195766 0.194739 -0.108597 -0.221771 -0.006281 0.002649 -0.018988 0.171110 0.171687
polarizability: 3.01457397e+02 -1.95527881e+00 1.94425886e+02 1.98136359e+01 2.04773537e+00 1.55790232e+02
1716.lowfreq: -9.3343 -0.0002 0.0005 0.0009 3.8816 9.3953 21.0799 28.8093 36.4847
frequency: 20.8293 28.7550 36.4727 56.6893 72.0916 100.4795 106.9385 127.3382 139.2941 153.2703 162.4862 169.7620 197.6992 210.6010 220.8233 244.7491 257.2530 276.4178 296.9430 320.1589 346.6542 367.4294 400.6119 406.5918 411.6905 458.8233 465.6958 494.2606 508.0309 509.7113 579.8021 599.9112 616.9289 646.5919 657.2501 705.0153 707.8357 720.6276 727.8191 744.0452 747.5473 783.8849 810.8910 860.3419 872.8687 890.7883 894.5723 899.8335 917.1859 949.1584 957.6769 981.0578 982.5254 988.6795 991.6884 1001.3430 1013.6180 1025.5244 1042.2467 1061.3695 1080.4704 1086.0015 1114.3556 1116.5796 1117.8976 1142.8632 1149.6389 1153.3184 1166.3698 1169.6357 1179.5703 1180.4122 1193.3333 1211.1335 1226.5575 1234.7779 1263.5278 1272.7069 1277.8340 1303.2104 1321.5326 1341.6823 1347.7423 1363.7712 1374.7075 1375.5438 1386.1641 1393.4020 1424.3157 1439.6990 1443.3864 1450.2391 1456.1007 1457.1376 1459.0616 1469.8808 1475.1089 1477.9108 1480.6102 1484.2102 1486.3484 1488.1482 1566.5199 1594.0113 1614.4126 1614.5491 2877.8360 2962.0548 2968.6144 2970.4240 2978.3635 2986.1216 2986.8697 3005.7021 3023.4630 3064.4233 3066.0660 3069.2940 3083.5606 3093.9799 3111.8045 3117.9655 3118.1552 3122.2662 3129.5797 3135.0408 3135.7544 3146.5096 3160.8335
redmass: 4.8038 4.1678 3.8893 3.4664 3.3123 3.6935 2.8317 2.8626 2.9019 1.2880 1.3439 1.7446 2.7554 1.5511 2.2806 3.6335 3.1208 4.6865 3.8360 3.0395 3.0339 2.8791 5.0243 2.8689 3.9608 3.5116 3.0064 3.8344 4.6844 3.3352 4.3414 4.4378 6.3588 4.7525 3.4219 2.4131 3.9857 3.0808 3.7480 1.9506 2.6207 2.7913 3.9164 1.2482 1.7937 1.8525 3.0144 1.4837 1.3825 3.9222 3.6203 2.1730 1.4392 2.8666 2.6782 1.5110 2.0017 2.1376 2.4052 2.2766 1.6147 3.3329 1.2430 1.2536 2.2630 1.7203 1.5014 1.5510 1.5988 1.0613 3.3286 1.1173 1.3610 2.4547 1.3883 1.3543 2.2529 1.6015 1.8075 1.5353 1.3148 1.3439 1.5008 3.5634 1.4061 2.1192 3.5191 2.2179 1.1755 2.0690 1.3272 1.1365 1.0633 1.0534 1.0670 1.0926 1.3453 1.0554 1.1177 1.9597 2.0017 1.0609 8.0937 6.1469 7.0991 6.2110 1.0698 1.0639 1.0309 1.0312 1.0847 1.0426 1.0780 1.0696 1.0868 1.1037 1.1039 1.1036 1.0992 1.1009 1.0869 1.1027 1.1025 1.0862 1.0908 1.0914 1.0916 1.0955 1.1014
irintensity: 0.0181 0.1487 0.0181 0.5596 4.3523 2.1619 6.3607 3.2917 1.0782 0.7649 0.0654 0.2829 4.5215 2.2580 5.5549 5.0701 2.0970 4.7069 2.5336 0.2514 1.3980 0.8524 1.8858 0.4450 8.2556 2.7732 7.0847 3.5095 16.6752 14.3794 1.4944 7.0040 0.1182 12.3681 0.7072 29.2497 4.7915 34.2863 1.2212 47.7001 5.7210 16.4275 4.1322 0.1715 5.8762 2.7951 3.5059 42.7873 2.9526 53.7561 70.6287 3.4005 0.0577 1.7274 1.8268 5.1249 16.0765 12.8774 36.3568 7.9935 8.3364 88.4754 13.9538 7.6236 42.7120 5.9248 8.6035 3.8959 13.4762 0.2595 28.9258 1.7114 6.2336 1.3024 17.7553 5.9882 80.4897 32.9295 64.0892 5.3088 11.1606 1.8833 32.1359 6.8653 10.4096 11.5352 9.7843 2.8938 0.3640 11.5852 4.4668 12.8007 0.5186 13.8455 10.5610 13.1889 6.5983 6.1074 15.9477 81.9270 82.0058 36.6310 0.5577 0.8091 8.3066 5.5602 60.8224 28.5661 92.5778 63.7194 11.7591 27.9559 26.9732 17.8889 47.3771 33.3986 22.3294 38.1197 26.3668 41.0380 9.6253 23.5222 30.4135 0.3637 9.8483 19.7210 3.2774 32.3381 31.0148
temp: 298.150 k
press: 1.00000 atm
elementType: 8 8 7 6 6 6 6 6 6 6 6 6 6 6 6 6 6 6 6 6 6 6 1 1 1 1 1 1 1 1 1 1 1 1 1 1 1 1 1 1 1 1 1 1 1
symmnumber: 1
zpe: 985054.5 jmol-1
zpe.correction: 0.375187 hartree
zpe.thermalcorrener: 0.396415 hartree
zpe.thermalcorrenthalpy: 0.397359 hartree
zpe.thermalcorrgfe: 0.324017 hartree
zpe.sumelectzpe: -941.347508 hartree
zpe.sumelectthermal: -941.326280 hartree
zpe.sumelectthermalent: -941.325336 hartree
zpe.sumelectthermalfe: -941.398678 hartree
dipole: 0.7068 -0.4439 -0.0149
dipole: 0.8347
quadrupole: -120.6978 -130.9151 -125.5729
quadrupole: 0.0780 2.7704 -0.5138
quadrupole: 5.0308 -5.1865 0.1557 0.0780 2.7704 -0.5138
hfenergy: -941.7226951 hartree
pointgroup: C01 [X(C19H23N1O2)]
dipole: 0.2774024 0.1681046 -0.0513698 debye
polarizability: 301.37377|-4.2058597|191.6519791|-19.7628075|-10.1861977|158.6477657 unknown
InChI: InChI=1S/C19H23NO2/c1-14-17-12-19(22-3)18(21-2)11-16(17)9-10-20(14)13-15-7-5-4-6-8-15/h4-8,11-12,14H,9-10,13H2,1-3H3
charge 0 multiplicity 1
45 atoms
O  4.606169 -1.094785 -0.862266
O  4.52732 1.737021 -0.087812
N  -1.432481 -0.891966 0.621285
C  -0.149308 -1.644539 0.514396
C  -1.318718 0.237733 1.582546
C  1.074738 -0.728584 0.318108
C  -0.27095 1.295845 1.147106
C  1.024524 0.652392 0.660436
C  -1.996401 -0.499781 -0.697216
C  0.046444 -2.578844 1.73684
C  2.278774 -1.27075 -0.192303
C  2.196605 1.436533 0.520842
C  -3.447952 -0.037253 -0.602824
C  3.4329 -0.481754 -0.355303
C  3.399815 0.887721 0.038463
C  -4.368435 -0.714586 0.237378
C  -3.909468 1.049424 -1.385435
C  -5.722208 -0.317072 0.287188
C  -5.265891 1.44815 -1.341023
C  -6.177455 0.765092 -0.504148
C  5.076282 -0.543427 -2.154096
C  5.684132 1.34607 0.750674
H  -0.239201 -2.296384 -0.378138
H  -1.039142 -0.181802 2.565802
H  -2.312275 0.704382 1.698198
H  -0.064413 1.98732 1.98684
H  -0.694134 1.921597 0.334196
H  -1.948196 -1.40168 -1.340736
H  -1.39839 0.285478 -1.220738
H  -0.83059 -3.24072 1.840769
H  0.952418 -3.198161 1.610818
H  0.166798 -2.004364 2.672347
H  2.337494 -2.324778 -0.489491
H  2.193523 2.497154 0.798294
H  -3.997924 -1.54121 0.854267
H  -3.204327 1.585957 -2.033383
H  -6.423359 -0.84887 0.940928
H  -5.60796 2.290908 -1.952753
H  -7.228399 1.073711 -0.465555
H  6.00289 -1.090285 -2.386976
H  5.274871 0.540769 -2.07424
H  4.322065 -0.728246 -2.942846
H  6.006877 0.31382 0.523858
H  5.420802 1.42875 1.822495
H  6.481437 2.064119 0.504605
