program: Gaussian 09
title: 000029775
version: EM64L-G09RevD.01
frameworkgroup: C1[X(C9H20O)]
method: RPBEPBE
basis: SDD
operation: Freq
keyword: #pfreq=noraman
keyword: PBEPBE/SDD
title: #p freq=noraman PBEPBE/SDD
converged: YES YES NO NO
title: Mulliken charges:
elementType: O C C C C C C C C C H H H H H H H H H H H H H H H H H H H H
charge: -0.465600 0.015113 -0.438131 -0.415367 -0.392086 -0.390268 -0.027570 -0.716155 -0.722650 -0.718627 0.178208 0.187958 0.246395 0.219171 0.199921 0.200668 0.191237 0.189632 0.191935 0.179803 0.211786 0.212416 0.215794 0.244685 0.206139 0.207672 0.205442 0.230927 0.214796 0.336755
chargesum: 0.00000
title: Mulliken charges with hydrogens summed into heavy atoms:
elementType: O C C C C C C C C C
charge: -0.128845 0.193321 -0.003777 0.003726 -0.000181 -0.008702 0.152232 -0.076159 -0.064154 -0.067462
polarizability: 1.11635525e+02 7.57845086e-01 1.05005419e+02 -7.59639436e-01 -7.73918244e-01 8.76914677e+01
1716.lowfreq: -24.4102 -11.9893 0.0005 0.0007 0.0009 6.0301 30.6942 37.1618 76.0746
frequency: 30.4385 32.9732 76.0578 94.9243 122.0215 151.1614 189.3567 210.5163 231.8166 251.1960 272.7811 286.3458 321.8813 351.2266 386.4520 429.3243 451.1538 460.4308 540.8511 737.1792 758.0634 769.2171 815.0002 830.5293 888.6050 913.4027 950.5482 959.9322 1010.2959 1019.9706 1038.7117 1043.6138 1063.6705 1073.9069 1079.1623 1125.7531 1142.4538 1174.6500 1181.9994 1236.9979 1244.4779 1255.2813 1276.9839 1277.6170 1289.2986 1319.3096 1332.0802 1342.4990 1349.1686 1360.9818 1379.8892 1383.9911 1387.2742 1394.1903 1445.7554 1467.8285 1468.2582 1468.5137 1470.0743 1475.5883 1477.7723 1483.4641 1488.0848 1501.7037 2926.2014 2932.5584 2959.2160 2965.3878 2970.2035 2972.9893 2973.6567 2978.3777 2981.0952 3004.1961 3014.5706 3032.0565 3053.9246 3061.3123 3063.3487 3066.5386 3071.4628 3076.6468 3083.0829 3560.6412
redmass: 3.3428 3.0956 2.5060 2.3466 2.0335 1.7201 2.6084 1.3235 1.0623 1.4446 1.4651 1.2642 2.0874 2.5471 3.2918 2.7415 2.3173 2.4375 2.1780 1.2358 1.9998 1.3043 2.0304 1.4947 1.9764 1.7676 1.9388 1.4364 1.4959 1.9284 2.1793 1.4501 2.1586 1.6964 2.4197 1.8950 2.1029 2.4139 1.3589 1.3054 1.3029 1.2492 1.1687 1.2244 1.1402 1.2927 1.3698 1.4452 1.6066 1.3710 1.7076 1.2326 1.2176 1.2126 1.0860 1.0569 1.0641 1.0575 1.0670 1.0529 1.0497 1.0745 1.0594 1.0616 1.0838 1.0814 1.0592 1.0590 1.0375 1.0374 1.0390 1.0606 1.0631 1.1007 1.0998 1.0948 1.0999 1.0982 1.0989 1.0993 1.0993 1.0998 1.0996 1.0661
irintensity: 0.9674 0.8149 0.6131 2.6705 0.9670 0.7427 0.3312 0.9834 0.1992 0.2850 31.9274 111.9046 0.4565 2.8687 1.4517 9.0136 1.5625 3.1472 7.3749 2.1648 11.5554 2.1245 12.4439 13.9929 0.4510 12.5190 19.2482 13.8374 1.1147 3.7874 3.0282 7.6201 27.7815 32.8909 8.0042 1.8749 10.0256 1.1456 0.4995 10.0526 0.3623 23.3664 1.1611 1.4554 1.8564 7.4419 1.8094 1.5212 0.3022 0.2107 27.1584 14.1593 14.2552 16.0252 1.7644 4.4059 7.0957 9.5172 9.5455 3.9789 5.2621 30.5466 8.4404 5.5212 53.5100 21.3228 4.8652 69.3929 29.8089 47.7941 9.1753 11.7650 74.5041 2.5740 78.2700 9.3298 46.4441 51.2446 47.3573 59.0207 59.9115 54.9773 43.2391 4.3654
temp: 298.150 k
press: 1.00000 atm
elementType: 8 6 6 6 6 6 6 6 6 6 1 1 1 1 1 1 1 1 1 1 1 1 1 1 1 1 1 1 1 1
symmnumber: 1
zpe: 716516.0 jmol-1
zpe.correction: 0.272907 hartree
zpe.thermalcorrener: 0.286556 hartree
zpe.thermalcorrenthalpy: 0.287500 hartree
zpe.thermalcorrgfe: 0.232152 hartree
zpe.sumelectzpe: -429.311005 hartree
zpe.sumelectthermal: -429.297355 hartree
zpe.sumelectthermalent: -429.296411 hartree
zpe.sumelectthermalfe: -429.351759 hartree
dipole: 1.2272 -1.3525 -0.0077
dipole: 1.8263
quadrupole: -57.7130 -67.6615 -65.4304
quadrupole: -2.3212 -1.6947 0.1327
quadrupole: 5.8886 -4.0598 -1.8288 -2.3212 -1.6947 0.1327
hfenergy: -429.5839114 hartree
pointgroup: C01 [X(C9H20O1)]
dipole: -0.522177 -0.4928217 -0.0269858 debye
polarizability: 111.5002863|-1.2729645|105.0852133|-0.1455851|1.3969362|87.7469117 unknown
InChI: InChI=1S/C9H20O/c1-4-9(5-2)7-6-8(3)10/h8-10H,4-7H2,1-3H3
charge 0 multiplicity 1
30 atoms
O  -2.541056 1.087743 0.655845
C  1.613869 0.061221 0.276142
C  0.145772 -0.127778 0.752033
C  -0.892828 -0.329944 -0.374847
C  2.1781 -1.174868 -0.480483
C  1.813764 1.341475 -0.585943
C  -2.33902 -0.292624 0.145687
C  2.190585 -2.48399 0.339052
C  1.333216 2.650581 0.077817
C  -3.378047 -0.62767 -0.939064
H  2.227936 0.190056 1.196427
H  0.098286 -0.993746 1.443893
H  -0.1614 0.752688 1.345011
H  -0.795104 0.466475 -1.138001
H  -0.728796 -1.298151 -0.887757
H  1.602387 -1.329568 -1.416142
H  3.215308 -0.941646 -0.798259
H  2.894293 1.428739 -0.822795
H  1.300214 1.214661 -1.561436
H  -2.441142 -1.010229 0.992055
H  2.740685 -2.35008 1.290083
H  2.681845 -3.300157 -0.222722
H  1.168014 -2.821365 0.588934
H  0.237787 2.657542 0.221065
H  1.803889 2.788149 1.070408
H  1.596158 3.527244 -0.543191
H  -4.410395 -0.581913 -0.540772
H  -3.29951 0.089264 -1.776294
H  -3.218612 -1.647579 -1.336054
H  -3.470898 1.174772 0.986309
