program: Gaussian 09
title: 000003011
version: EM64L-G09RevD.01
frameworkgroup: C1[X(C20H34O2)]
method: RPBEPBE
basis: SDD
operation: Freq
keyword: #pfreq=noraman
keyword: PBEPBE/SDD
title: #p freq=noraman PBEPBE/SDD
converged: YES YES NO NO
title: Mulliken charges:
elementType: O O C C C C C C C C C C C C C C C C C C C C H H H H H H H H H H H H H H H H H H H H H H H H H H H H H H H H H H
charge: -0.414743 -0.238758 -0.367937 -0.353979 -0.388298 -0.377084 -0.477957 -0.484358 -0.367552 -0.351390 -0.472983 -0.356863 -0.175120 -0.165664 -0.171435 0.178315 -0.697497 -0.534567 -0.194927 -0.529182 -0.162187 -0.159390 0.226000 0.185778 0.186960 0.185392 0.199142 0.192802 0.210914 0.227538 0.201412 0.204716 0.251727 0.251498 0.189446 0.198546 0.178630 0.218475 0.194078 0.232889 0.192653 0.193993 0.219785 0.220829 0.220193 0.208622 0.213684 0.205833 0.206646 0.203202 0.220069 0.204863 0.203513 0.219215 0.219014 0.375499
chargesum: 0.00000
title: Mulliken charges with hydrogens summed into heavy atoms:
elementType: O O C C C C C C C C C C C C C C C C C C C C
charge: -0.039244 -0.238758 0.043841 0.018372 0.003646 0.061368 -0.071829 0.018867 0.020440 0.045715 -0.046015 0.029783 0.044665 0.054529 0.049394 0.178315 -0.069359 -0.124719 0.025142 -0.120806 0.057028 0.059624
polarizability: 2.80891973e+02 5.32647616e+00 2.32761916e+02 -9.18932665e-01 5.45604670e+00 1.73997512e+02
1716.lowfreq: -0.0006 -0.0006 0.0005 1.1879 3.9505 6.9748 12.2815 21.5722 23.7332
frequency: 12.1518 21.5580 23.6963 34.5485 36.4065 46.9553 51.6483 55.8220 61.0024 65.5244 71.3399 82.4984 106.7974 112.9564 126.9006 128.9225 138.3346 150.4371 161.0986 177.7531 179.6404 210.4605 226.3552 230.3266 256.1989 264.5365 294.3259 327.1090 332.5995 345.0179 376.7837 407.4466 461.5159 473.0410 484.3991 491.0409 507.5037 510.9330 544.1070 591.6059 643.7906 724.7404 729.1684 742.7679 748.7253 770.9747 778.9546 790.4909 823.7904 844.8390 847.3382 864.2959 886.8523 902.5968 910.8067 932.5758 947.7143 961.8896 970.0898 976.0818 979.4317 988.9102 998.5786 1009.6051 1021.0103 1033.7400 1041.7998 1046.5887 1057.4344 1066.6450 1075.7754 1078.4123 1082.9737 1091.9818 1097.2751 1110.2120 1115.2022 1121.9466 1158.4889 1172.9821 1185.5788 1195.7401 1203.0222 1219.6472 1232.3625 1234.1632 1246.2730 1253.2610 1257.8815 1265.2797 1271.4955 1281.5664 1284.4689 1286.1614 1287.7832 1290.6417 1293.0342 1296.1288 1298.2425 1301.6998 1304.3908 1313.3023 1328.3719 1337.8631 1342.6184 1346.8512 1354.3558 1359.7710 1371.3179 1385.1977 1436.6581 1452.3012 1453.3983 1458.5601 1461.3415 1462.4325 1463.8517 1467.3531 1470.7203 1473.8666 1475.8047 1480.5182 1485.5848 1489.0066 1660.5246 1677.4605 1683.5687 1688.5285 2942.8199 2946.2912 2947.6852 2952.6663 2953.3029 2955.1849 2960.8630 2961.2464 2965.8371 2968.3486 2969.1211 2980.7225 2990.7421 2993.5855 2995.7468 3004.0363 3004.4925 3019.7486 3021.3784 3029.1560 3031.1355 3031.6084 3040.7761 3041.3525 3060.9276 3061.3384 3062.6241 3066.1661 3067.7713 3069.6141 3072.5868 3077.6439 3083.5178 3508.5574
redmass: 4.7024 6.2035 4.8252 4.3248 3.6630 3.7804 3.2439 1.9967 2.1175 3.4913 2.9680 3.9374 2.0256 2.4088 2.1362 1.9331 1.9739 2.5403 2.2108 4.0285 3.1503 3.8060 2.0604 1.2397 2.9954 2.9894 2.1321 3.0014 3.4845 3.7477 3.1608 2.4032 2.6477 3.1027 2.9589 2.4716 2.6297 2.0138 2.9556 4.1926 1.3441 1.0845 1.0669 1.2182 1.1870 1.4392 1.5472 1.4971 1.4952 1.4143 2.1100 3.3411 1.8728 2.0017 1.6835 1.9315 1.3971 1.2689 1.5065 1.2818 1.2009 1.6287 3.4391 2.0531 2.3524 3.9609 2.5771 2.1775 2.3722 2.4142 2.0284 2.0185 1.9539 2.7635 2.6801 2.1209 1.7666 1.5065 2.2325 1.5980 1.3895 1.2947 1.4357 1.3714 1.3630 1.2688 1.2580 1.3009 1.3361 1.3047 1.2360 1.2109 1.1725 1.2092 1.0924 1.1685 1.2072 1.1774 1.1749 1.2476 1.3638 1.3140 1.3644 1.4438 1.5172 1.4944 1.6089 1.6122 1.8237 1.2188 1.0855 1.0904 1.0947 1.0929 1.0795 1.0818 1.0670 1.0664 1.0824 1.0919 1.0432 1.0745 1.0990 1.0906 8.1223 6.3586 6.5696 6.7165 1.0646 1.0643 1.0591 1.0595 1.0608 1.0590 1.0627 1.0592 1.0617 1.0582 1.0378 1.0639 1.0793 1.0764 1.0958 1.0999 1.0995 1.0990 1.1025 1.0936 1.0947 1.0975 1.1019 1.1034 1.0935 1.1011 1.0944 1.1007 1.0992 1.0918 1.0876 1.0907 1.0876 1.0639
irintensity: 0.0270 0.7543 0.1100 0.0691 0.1560 0.3486 0.0273 0.2201 0.2188 0.7249 0.2018 0.5250 0.0376 0.0937 0.2363 0.1309 0.0043 0.1787 0.5954 0.6400 1.0301 1.0198 0.8779 0.2142 0.3067 2.2034 2.9400 1.0162 2.4379 9.7821 1.9308 0.7603 7.5187 13.0048 4.1325 1.8409 7.9663 24.4800 0.3023 17.0228 118.6124 14.4880 11.3268 0.8732 0.5884 0.2010 0.1528 6.5301 4.5484 2.9328 1.3274 2.6987 5.8619 0.2987 2.0757 4.1111 0.3172 8.5469 62.9199 56.5345 58.9513 6.7876 6.4135 20.6729 133.5468 1.6743 28.9451 56.6935 1.3712 33.2364 19.6164 9.9340 9.6307 0.1088 26.4471 8.5776 2.4337 1.4366 3.4363 6.9142 3.4422 4.0784 0.0794 5.2454 4.1974 1.1452 0.7904 2.2293 3.3451 6.7032 1.6534 0.1337 0.4994 2.0537 0.7285 0.2906 3.6875 1.9811 1.5051 1.9306 7.2261 0.8847 0.2098 4.7317 12.9250 0.8098 1.7353 4.4391 33.7069 10.3224 28.8812 18.8229 8.0306 13.2331 0.1748 1.6276 0.6838 1.0285 1.2704 1.6130 11.7167 1.5539 16.7970 24.3951 274.2829 0.0417 0.2283 1.0706 42.3400 50.1602 13.3322 20.5727 2.6023 0.1362 25.7907 1.5763 84.6890 135.2627 32.9238 4.9379 19.4651 31.6325 2.9788 3.8909 13.3607 25.7543 0.8742 14.2437 3.1116 5.4143 44.9935 57.7021 7.5591 54.9399 36.7292 105.1844 62.9927 7.4301 51.4190 2.4558 127.7607 17.3559
temp: 298.150 k
press: 1.00000 atm
elementType: 8 8 6 6 6 6 6 6 6 6 6 6 6 6 6 6 6 6 6 6 6 6 1 1 1 1 1 1 1 1 1 1 1 1 1 1 1 1 1 1 1 1 1 1 1 1 1 1 1 1 1 1 1 1 1 1
symmnumber: 1
zpe: 1292190.1 jmol-1
zpe.correction: 0.492169 hartree
zpe.thermalcorrener: 0.519963 hartree
zpe.thermalcorrenthalpy: 0.520907 hartree
zpe.thermalcorrgfe: 0.428468 hartree
zpe.sumelectzpe: -931.169373 hartree
zpe.sumelectthermal: -931.141579 hartree
zpe.sumelectthermalent: -931.140635 hartree
zpe.sumelectthermalfe: -931.233074 hartree
dipole: -0.3988 1.8688 0.4264
dipole: 1.9578
quadrupole: -137.1016 -135.5798 -132.2887
quadrupole: 1.1877 0.5740 -0.7910
quadrupole: -2.1115 -0.5898 2.7013 1.1877 0.5740 -0.7910
hfenergy: -931.661542 hartree
pointgroup: C01 [X(C20H34O2)]
dipole: 0.1390633 0.7364119 -0.1779765 debye
polarizability: 281.1343032|-4.0889417|232.350267|-0.2535657|-6.3528441|174.1668304 unknown
InChI: InChI=1S/C20H34O2/c1-2-3-4-5-6-7-8-9-10-11-12-13-14-15-16-17-18-19-20(21)22/h6-7,9-10,12-13,21H,2-5,8,11,14-19H2,1H3
charge 0 multiplicity 1
56 atoms
O  -3.580851 3.953738 -0.282017
O  -2.890893 1.863141 0.445403
C  2.479522 2.25685 0.199322
C  1.311581 3.114519 -0.335972
C  3.859866 2.735765 -0.302771
C  -0.069975 2.608401 0.135197
C  5.042698 1.872332 0.222475
C  -1.216602 3.500763 -0.378891
C  -3.442736 -2.140477 0.237016
C  -4.645716 -1.285679 -0.221421
C  -2.086949 -1.60275 -0.296641
C  -5.999334 -1.803092 0.316512
C  4.996805 0.443331 -0.280466
C  4.899463 -0.662977 0.501049
C  -0.897935 -2.385485 0.217683
C  -2.595296 2.988299 -0.016143
C  -7.197876 -0.943322 -0.141227
C  4.801448 -2.091462 -0.013566
C  0.016104 -3.032662 -0.55136
C  1.21118 -3.809365 -0.016744
C  3.494933 -2.749277 0.408047
C  2.53529 -3.193038 -0.443523
H  2.329992 1.199222 -0.094301
H  2.469387 2.2736 1.309495
H  1.342195 3.119861 -1.446278
H  1.452144 4.168779 -0.015708
H  4.020372 3.789845 0.004133
H  3.869129 2.727885 -1.412934
H  -0.097693 2.57297 1.241772
H  -0.227277 1.568349 -0.208987
H  5.039445 1.87824 1.33073
H  5.992853 2.348454 -0.098308
H  -1.123689 4.537225 -0.002896
H  -1.178374 3.581761 -1.484898
H  -3.411925 -2.160782 1.346496
H  -3.576485 -3.191026 -0.092592
H  -4.679374 -1.265007 -1.331544
H  -4.48841 -0.2383 0.106688
H  -2.093971 -1.616184 -1.405161
H  -2.000053 -0.539918 0.012473
H  -6.148673 -2.852015 -0.012704
H  -5.963729 -1.827848 1.42506
H  5.022005 0.318306 -1.375962
H  -0.786866 -2.424709 1.314442
H  4.857536 -0.539461 1.595373
H  -7.273239 -0.925338 -1.245203
H  -8.153967 -1.331588 0.256501
H  -7.087304 0.102338 0.203952
H  5.652533 -2.683104 0.387819
H  4.891111 -2.102643 -1.116264
H  -0.085983 -2.99261 -1.648047
H  1.160523 -4.854161 -0.393714
H  1.161595 -3.862499 1.087368
H  3.325693 -2.836108 1.493345
H  2.69548 -3.090839 -1.528911
H  -4.475405 3.577252 -0.057897
