program: Gaussian 09
title: 000029810
version: EM64L-G09RevD.01
frameworkgroup: C1[X(C19H30N4O)]
method: RPBEPBE
basis: SDD
operation: Freq
keyword: #p
keyword: freq=noraman
keyword: PBEPBE/SDD
title: #p freq=noraman PBEPBE/SDD
converged: YES YES NO NO
title: Mulliken charges:
elementType: O N N N N C C C C C C C C C C C C C C C C C C C H H H H H H H H H H H H H H H H H H H H H H H H H H H H H H
charge: -0.245641 -0.080246 -0.207626 -0.098018 -0.070443 -0.358073 -0.514891 0.161567 -0.435742 -0.345764 -0.327396 -0.375932 0.292182 -0.317794 -0.324382 -0.003448 -0.326549 -0.323957 -0.381160 -0.348083 -0.230381 -0.235652 -0.672785 -0.670438 0.183962 0.242219 0.263638 0.211298 0.221253 0.242630 0.191062 0.217409 0.198965 0.189056 0.207858 0.231361 0.195456 0.215702 0.213341 0.194733 0.193809 0.206259 0.197322 0.199603 0.233401 0.247787 0.220836 0.223906 0.227832 0.210717 0.212154 0.227133 0.211042 0.208910
chargesum: 0.00000
title: Mulliken charges with hydrogens summed into heavy atoms:
elementType: O N N N N C C C C C C C C C C C C C C C C C C C
charge: -0.245641 -0.080246 -0.207626 -0.098018 -0.070443 0.068108 -0.039956 0.161567 0.028141 0.062706 0.060625 0.063287 0.292182 0.093364 0.083692 -0.003448 0.073519 0.072969 -0.147759 -0.100297 -0.009546 -0.011746 -0.022083 -0.023353
polarizability: 3.04539752e+02 2.39551485e+01 2.53824691e+02 1.51273046e+01 -9.86604334e+00 1.62872016e+02
1716.lowfreq: -7.9966 -4.4120 -0.0007 -0.0006 -0.0004 5.5996 10.8877 16.2447 22.9110
frequency: 9.2008 16.0963 22.5266 29.5838 40.3865 47.0422 63.6408 72.4430 84.1614 89.4583 115.1663 150.7891 160.3081 178.6470 201.0335 212.3812 231.5292 241.9746 263.1221 268.8474 285.1412 301.9335 308.4391 321.9877 350.7507 384.3650 396.7339 405.2674 432.5775 443.6786 451.5916 470.9848 483.3287 517.9170 533.7534 583.3884 594.4378 604.0854 671.2506 708.7810 719.9503 751.4355 761.6999 769.0146 770.1759 777.0832 789.7031 796.5034 801.6065 811.5279 842.4728 853.5799 859.9571 892.5691 899.7204 918.2704 933.5725 974.0701 989.4041 996.8082 1005.5436 1019.4648 1026.4598 1034.6304 1035.8869 1054.1200 1061.9729 1073.9235 1075.6757 1084.4890 1085.0128 1091.9010 1101.4627 1122.4555 1126.3085 1138.7056 1142.7868 1161.6188 1174.3743 1189.4252 1202.8029 1207.4758 1230.5162 1238.1649 1249.1692 1266.6835 1272.3809 1280.7634 1285.5009 1288.3625 1290.1113 1292.6779 1300.2316 1320.1170 1330.4572 1337.5426 1344.6755 1353.6945 1359.6986 1363.5792 1370.9668 1373.1977 1382.6296 1387.9551 1388.5037 1389.1294 1402.3534 1445.8427 1446.3241 1448.4460 1452.5182 1454.6356 1458.6725 1462.2237 1462.9079 1468.4592 1470.2251 1477.0087 1479.3997 1480.2920 1485.5559 1487.8317 1490.4148 1503.5008 1592.3316 1625.8459 2837.2055 2847.8591 2859.8315 2866.3493 2870.5384 2884.2912 2956.8480 2961.0487 2982.1959 2984.1496 2996.5551 3008.7883 3022.1646 3026.6841 3031.5735 3037.3021 3038.2986 3049.4001 3074.0418 3076.5500 3080.0549 3083.1585 3085.2711 3091.5489 3092.0734 3092.4282 3124.1154 3136.8755 3153.4119 3169.1604
redmass: 3.2501 4.3953 3.1717 4.0266 4.5574 3.1353 2.9850 3.1689 2.0738 3.4850 3.4698 1.8985 2.8893 3.0042 2.5413 1.4827 1.8965 1.8030 2.0321 2.3313 2.1207 3.4267 3.4071 2.4749 3.6338 2.7545 2.2844 2.9521 4.9289 2.8254 3.6120 2.8147 2.8265 4.2334 4.1715 3.6609 2.3698 4.2821 5.1945 4.4376 3.8362 1.3870 1.8917 1.6412 2.4980 2.8817 1.5866 1.2179 1.3138 3.6176 1.5916 1.4975 4.7415 3.0565 2.4635 2.1060 1.3815 1.3016 2.2790 2.9781 2.0348 1.9462 2.2231 3.6023 3.3816 1.9463 1.9536 2.5551 1.9480 2.2438 3.3766 2.4897 2.0899 1.8110 2.1919 2.6441 1.7086 1.2081 2.2040 1.0797 1.5981 2.2277 2.7109 1.6819 1.3416 1.3323 1.4622 1.2032 1.3605 1.2437 1.2002 1.2138 1.3892 1.4137 1.3129 2.0337 1.2605 1.4467 1.3540 1.3464 2.3058 1.3225 1.4803 1.4337 1.2318 1.2385 3.6119 1.0818 1.1385 2.4830 1.1058 1.2055 1.1007 1.0530 1.0657 1.5642 1.3693 1.1412 1.1033 1.1042 1.0712 1.0884 1.0791 7.5799 7.1715 7.7823 1.0712 1.0700 1.0715 1.0715 1.0694 1.0713 1.0663 1.0665 1.0359 1.0359 1.0669 1.0874 1.0602 1.0870 1.0904 1.0876 1.0864 1.0884 1.0987 1.0983 1.0967 1.1038 1.0979 1.1004 1.0973 1.0999 1.0860 1.0902 1.0951 1.0989
irintensity: 0.0521 0.1244 0.2690 0.3954 0.0475 0.4930 0.1799 0.6189 0.2815 0.9948 0.9891 1.0832 0.6917 2.5211 7.0353 1.4061 2.2703 1.9735 0.4255 1.1934 0.4239 3.5494 0.7515 11.3221 5.4124 0.5215 2.2115 10.5206 2.5259 2.2910 1.1944 1.8273 6.7542 1.5666 0.2875 2.2483 7.3148 3.9837 2.7485 15.1059 0.4752 96.9165 5.0736 5.6678 2.4579 7.0232 0.1860 2.9053 5.6558 22.6935 0.0797 0.4813 7.7424 7.7485 8.0913 2.4863 2.7823 0.1456 3.4713 22.4999 9.7063 5.9145 9.6842 5.7181 18.3196 21.3736 21.8870 14.2658 27.0573 6.0399 47.2548 16.6473 4.5817 11.9205 68.2556 32.7530 13.2081 7.0261 19.6745 1.9673 9.8011 34.5627 15.1074 8.9179 22.8723 9.6495 11.9134 9.3336 3.6193 21.2929 11.2869 4.9334 11.6913 3.0911 10.0858 10.5953 12.3959 6.1822 4.1945 1.5398 74.2920 7.4624 14.5419 8.6434 22.8183 15.5920 7.6944 2.7748 8.2738 55.8368 20.3925 17.2532 5.1536 6.5593 2.3534 1.8494 6.8964 6.0952 11.5585 1.7424 12.8742 19.1996 12.0319 51.7539 0.1984 9.7244 38.9685 97.8223 33.2070 106.6672 118.4339 131.3332 33.6787 102.2809 26.5085 30.1179 17.8137 43.6712 27.6436 56.9667 22.9057 13.2624 30.6098 10.9909 38.3536 86.0401 33.5827 28.5715 35.3743 26.7723 24.2539 37.3525 1.9354 15.8700 26.3838 24.5323
temp: 298.150 k
press: 1.00000 atm
elementType: 8 7 7 7 7 6 6 6 6 6 6 6 6 6 6 6 6 6 6 6 6 6 6 6 1 1 1 1 1 1 1 1 1 1 1 1 1 1 1 1 1 1 1 1 1 1 1 1 1 1 1 1 1 1
symmnumber: 1
zpe: 1224291.9 jmol-1
zpe.correction: 0.466308 hartree
zpe.thermalcorrener: 0.490860 hartree
zpe.thermalcorrenthalpy: 0.491804 hartree
zpe.thermalcorrgfe: 0.407605 hartree
zpe.sumelectzpe: -1034.358271 hartree
zpe.sumelectthermal: -1034.333719 hartree
zpe.sumelectthermalent: -1034.332775 hartree
zpe.sumelectthermalfe: -1034.416974 hartree
dipole: -0.6969 3.7258 -0.4523
dipole: 3.8173
quadrupole: -154.5311 -143.8677 -149.6438
quadrupole: -9.3091 4.0603 7.3409
quadrupole: -5.1836 5.4799 -0.2962 -9.3091 4.0603 7.3409
hfenergy: -1034.8245788 hartree
pointgroup: C01 [X(C19H30N4O1)]
dipole: 0.0013887 1.4904841 0.1844795 debye
polarizability: 312.4105197|-12.4088837|246.6616508|6.7460496|13.4208051|162.1642881 unknown
InChI: InChI=1S/C19H30N4O/c1-3-21(4-2)11-12-23-18-8-6-5-7-17(18)20-19(23)9-10-22-13-15-24-16-14-22/h5-8H,3-4,9-16H2,1-2H3
charge 0 multiplicity 1
54 atoms
O  -5.987271 -1.111078 0.569037
N  -3.180589 -1.655104 0.01982
N  1.307506 -0.324849 0.015818
N  0.412673 3.371782 -0.126231
N  1.383528 -2.378347 -1.004215
C  -1.72636 -1.708893 0.292979
C  -0.87866 -1.265055 -0.930982
C  0.597403 -1.339012 -0.663872
C  0.801485 0.980474 0.464501
C  -3.961584 -2.487016 0.974968
C  -3.721427 -0.271724 -0.010427
C  0.969807 2.088295 -0.608388
C  2.646095 -0.747862 0.09401
C  -5.44823 -2.482143 0.585574
C  -5.214453 -0.2944 -0.379556
C  2.674614 -2.036144 -0.540943
C  1.185317 4.563481 -0.571086
C  -1.050569 3.494089 -0.374547
C  3.79835 -0.15215 0.647611
C  3.889616 -2.752217 -0.628491
C  5.001851 -0.884233 0.551274
C  5.047245 -2.163613 -0.077527
C  2.525932 4.719378 0.171389
C  -1.758697 4.422298 0.630646
H  -1.451377 -1.097465 1.192192
H  -1.456821 -2.755442 0.524685
H  -1.105909 -1.942055 -1.769991
H  -1.159901 -0.241744 -1.244061
H  -0.263037 0.878798 0.73798
H  1.339187 1.285301 1.378959
H  -3.859898 -2.112843 2.025167
H  -3.576476 -3.523548 0.942252
H  -3.179248 0.323716 -0.768721
H  -3.596305 0.234745 0.982077
H  0.496485 1.750245 -1.562758
H  2.046864 2.209738 -0.819138
H  -5.571431 -2.944431 -0.417441
H  -6.055649 -3.02967 1.324912
H  -5.653006 0.715861 -0.3245
H  -5.333809 -0.699414 -1.407679
H  1.362501 4.545926 -1.675924
H  0.56705 5.456298 -0.367649
H  -1.255792 3.837586 -1.419974
H  -1.494668 2.483267 -0.28894
H  3.773948 0.829131 1.13466
H  3.917513 -3.733761 -1.111494
H  5.922123 -0.460558 0.968877
H  6.002831 -2.69673 -0.130899
H  2.3514 4.793441 1.258865
H  3.201674 3.863317 -0.009899
H  3.050189 5.632174 -0.167458
H  -1.607091 4.054353 1.660192
H  -1.372373 5.456205 0.580072
H  -2.844254 4.461802 0.422673
