program: Gaussian 09
title: 000032962
version: EM64L-G09RevD.01
frameworkgroup: C1[X(C22H26N2O)]
method: RPBEPBE
basis: SDD
operation: Freq
keyword: #p
keyword: freq=noraman
keyword: PBEPBE/SDD
title: #p freq=noraman PBEPBE/SDD
converged: YES YES NO NO
title: Mulliken charges:
elementType: O N N C C C C C C C C C C C C C C C C C C C C C C H H H H H H H H H H H H H H H H H H H H H H H H H H
charge: -0.276190 -0.107102 0.023952 -0.342635 -0.417130 -0.318488 -0.321182 -0.265228 -0.678258 -0.680186 -0.201575 0.238255 0.238318 0.398393 0.411132 -0.412461 -0.411913 -0.365383 -0.340356 -0.416474 -0.420872 -0.244623 -0.257281 -0.246441 -0.248610 0.177973 0.239246 0.228630 0.194280 0.185241 0.200570 0.186461 0.199573 0.201937 0.216906 0.227023 0.207936 0.204449 0.223369 0.226175 0.201914 0.211151 0.210151 0.256089 0.258943 0.239211 0.239518 0.230868 0.232482 0.230301 0.231941
chargesum: 0.00000
title: Mulliken charges with hydrogens summed into heavy atoms:
elementType: O N N C C C C C C C C C C C C C C C C C C C C C C
charge: -0.276190 -0.107102 0.023952 0.074584 0.005780 0.067324 0.064853 0.153614 -0.038849 -0.028728 -0.201575 0.238255 0.238318 0.398393 0.411132 -0.201309 -0.201762 -0.109294 -0.081413 -0.177264 -0.181354 -0.013754 -0.024799 -0.016141 -0.016669
polarizability: 3.46524429e+02 4.48498259e+01 2.89803995e+02 -3.54031992e+01 1.86276519e+01 1.89684571e+02
1716.lowfreq: -7.5852 -5.0262 -0.0008 -0.0007 -0.0005 3.1482 6.4110 19.8831 21.0065
frequency: 4.9902 19.8782 20.9346 48.3083 55.6346 61.7960 78.1361 85.2791 87.9557 109.4507 122.7146 154.4683 175.5572 194.3861 199.7766 213.0300 234.0803 247.6706 254.7128 279.3620 292.7296 299.5492 327.0545 342.4263 368.8740 388.9665 398.1641 432.3951 445.2321 457.4307 475.2879 482.5600 508.5343 530.7590 551.0871 587.5603 605.2332 636.6015 670.4445 685.1291 713.4314 725.5785 734.6802 750.4897 761.3571 775.6439 780.4327 795.9602 797.8206 805.0955 813.3847 842.8277 867.6535 881.1944 888.1632 893.1829 906.0044 922.7903 949.9312 957.3781 967.7414 984.2833 988.5240 994.1994 994.7860 1039.1082 1040.4737 1052.7453 1063.9801 1073.3437 1080.8470 1085.0072 1094.1363 1096.5775 1115.7444 1124.1545 1163.3026 1167.2654 1173.4973 1176.7744 1182.2267 1194.5489 1205.9251 1228.7000 1247.9937 1248.8601 1258.5541 1279.5604 1284.4983 1291.1760 1297.5056 1319.0616 1329.0622 1353.4698 1359.6333 1367.2146 1380.1464 1381.6535 1386.4932 1386.6573 1387.6148 1411.0897 1417.4874 1452.0943 1456.6426 1461.2671 1463.3094 1470.1772 1473.5715 1476.7796 1479.3877 1485.1818 1486.8185 1487.9417 1490.8896 1515.1764 1567.4170 1569.0457 1602.0161 1604.5878 1638.9508 2841.2824 2845.1494 2859.9047 2980.0654 2980.4455 2981.9227 2994.6004 3023.1824 3031.2484 3043.8189 3055.9417 3070.2011 3074.1162 3074.6718 3086.4187 3088.5379 3090.3433 3113.1246 3120.8597 3121.7313 3136.0512 3136.7690 3154.2396 3156.6588 3169.4449 3176.3114
redmass: 4.1363 4.2024 3.7306 4.5708 4.0370 2.9432 2.5815 2.1712 3.2141 3.4627 5.5256 1.5946 3.9941 3.0582 1.7912 1.7943 2.2678 3.3920 2.5723 2.4761 2.2816 4.2774 4.0411 5.8628 4.5543 3.3690 3.0885 3.6303 3.3209 2.7894 3.8227 3.5943 3.4893 5.2804 4.1214 3.0839 4.9059 5.1771 5.9310 5.7055 4.9880 1.5392 1.9947 2.0853 1.8066 1.7334 2.1135 1.2711 1.1690 3.3418 1.6973 2.9590 1.7457 1.7244 1.6636 2.8476 3.3112 2.6717 1.5997 1.4038 3.0608 1.3509 1.3403 1.3487 2.2483 2.9173 2.7069 2.2338 2.4141 1.9259 1.8287 2.2395 2.6044 2.5010 1.8320 1.8406 1.9430 1.8082 1.4241 1.1127 1.4784 1.3443 2.1527 1.9881 1.4416 1.4241 1.6085 1.1535 1.2187 1.1711 1.4928 1.4029 2.5483 1.3473 1.3372 1.3366 9.1142 1.4373 3.9480 1.3263 1.2298 1.6726 2.0257 1.0799 2.1721 1.0532 1.0553 1.0631 2.5381 1.0622 1.1066 1.0750 1.0638 2.9776 1.0715 6.1197 7.4252 6.9205 5.9312 6.0443 7.1647 1.0721 1.0721 1.0712 1.0357 1.0567 1.0358 1.0629 1.0866 1.0873 1.1010 1.0963 1.0979 1.0979 1.0964 1.0839 1.1003 1.1002 1.0941 1.0869 1.0871 1.0897 1.0891 1.0945 1.0966 1.0993 1.0970
irintensity: 0.0437 0.0058 0.2165 0.2394 0.0547 0.5983 1.1259 0.4468 0.2957 0.9277 2.2701 1.3893 1.3822 0.1673 1.1674 1.3400 0.1832 3.4265 1.6296 1.2147 0.7251 3.7724 2.3580 1.7408 1.2699 0.6328 4.0721 8.3690 1.6713 5.4589 5.1271 8.6373 0.9627 4.7770 4.4940 0.1168 9.3731 14.1771 6.9064 3.2132 2.2632 18.8893 10.4115 5.0182 11.5411 7.5272 76.2844 8.1685 14.7291 68.0484 46.3423 21.2638 19.0346 3.0117 2.2235 6.9365 133.5773 140.1232 1.9784 5.7236 8.9435 1.2752 0.2576 0.9250 4.1773 31.1965 3.1669 5.1666 21.8227 12.1508 21.7100 8.0721 19.5501 16.5004 1.4114 15.6230 3.6896 14.3225 3.2394 0.7897 7.0758 12.5096 23.5519 2.4237 6.8613 0.5349 0.5217 5.4417 12.0761 20.8578 7.0984 14.1824 5.7219 37.6569 1.4072 1.2784 8.1213 1.4814 11.9725 15.2030 18.1138 2.4300 9.4984 9.6716 3.1818 6.3074 2.2007 2.2330 5.8535 6.2154 13.7009 14.3293 13.0410 14.3776 10.1270 1.0224 2.5798 0.0395 1.3408 2.6459 1.2748 37.6831 40.1340 213.9483 23.0161 43.7249 37.4315 47.4371 15.8048 24.7968 16.5976 30.4250 22.6430 82.2656 62.0620 0.1860 41.3742 44.8736 24.0051 0.2833 22.6392 10.5149 15.6844 31.1791 28.1111 23.6704 10.6308
temp: 298.150 k
press: 1.00000 atm
elementType: 8 7 7 6 6 6 6 6 6 6 6 6 6 6 6 6 6 6 6 6 6 6 6 6 6 1 1 1 1 1 1 1 1 1 1 1 1 1 1 1 1 1 1 1 1 1 1 1 1 1 1
symmnumber: 1
zpe: 1118275.5 jmol-1
zpe.correction: 0.425929 hartree
zpe.thermalcorrener: 0.450059 hartree
zpe.thermalcorrenthalpy: 0.451003 hartree
zpe.thermalcorrgfe: 0.368539 hartree
zpe.sumelectzpe: -1036.764731 hartree
zpe.sumelectthermal: -1036.740601 hartree
zpe.sumelectthermalent: -1036.739657 hartree
zpe.sumelectthermalfe: -1036.822120 hartree
dipole: 0.0499 0.5133 0.7391
dipole: 0.9013
quadrupole: -136.2787 -136.9340 -145.8628
quadrupole: 0.7858 -2.0301 5.0157
quadrupole: 3.4131 2.7578 -6.1709 0.7858 -2.0301 5.0157
hfenergy: -1037.1906595 hartree
pointgroup: C01 [X(C22H26N2O1)]
dipole: -0.0259154 -0.1907345 0.2977904 debye
polarizability: 348.266378|44.8187194|286.1727745|34.1540205|-22.7403147|191.5738414 unknown
InChI: InChI=1S/C22H26N2O/c1-3-24(4-2)16-9-17-25-23-22-20-12-7-5-10-18(20)14-15-19-11-6-8-13-21(19)22/h5-8,10-15H,3-4,9,16-17H2,1-2H3
charge 0 multiplicity 1
51 atoms
O  -0.696126 1.114911 -0.371177
N  -4.897084 0.552501 0.272122
N  0.715751 1.442681 -0.208568
C  -3.478799 0.900322 0.545367
C  -2.947185 1.995242 -0.406481
C  -5.847145 1.530745 0.8671
C  -5.220466 -0.855823 0.630273
C  -1.482233 2.35485 -0.142789
C  -7.207701 1.569807 0.144331
C  -4.668592 -1.874035 -0.386527
C  1.50537 0.37382 -0.192682
C  2.954221 0.734958 -0.117439
C  1.060845 -1.045858 -0.329731
C  3.859786 0.125095 0.811398
C  1.498827 -2.073683 0.56873
C  3.511512 -0.970851 1.71974
C  2.503193 -1.898261 1.622808
C  3.418107 1.790854 -0.947361
C  0.134189 -1.374904 -1.356434
C  5.192679 0.6315 0.887377
C  0.931587 -3.378006 0.436668
C  4.744906 2.258349 -0.871396
C  -0.378111 -2.679359 -1.494909
C  5.638989 1.676102 0.059238
C  0.011962 -3.686969 -0.579791
H  -3.329921 1.225524 1.607695
H  -2.858511 -0.000909 0.405554
H  -3.070046 1.647043 -1.448414
H  -3.545955 2.922289 -0.304985
H  -6.00372 1.334844 1.959502
H  -5.386216 2.533666 0.796391
H  -4.852106 -1.109675 1.657308
H  -6.321174 -0.953071 0.660933
H  -1.318737 2.691705 0.899853
H  -1.118828 3.138817 -0.833303
H  -7.061792 1.811223 -0.922937
H  -7.735366 0.600655 0.203555
H  -7.865271 2.335775 0.596957
H  -5.072869 -1.66026 -1.391483
H  -3.565588 -1.839983 -0.447596
H  -4.956318 -2.902728 -0.097836
H  4.212531 -1.105057 2.555646
H  2.494353 -2.684782 2.390419
H  2.710408 2.247837 -1.64537
H  -0.196851 -0.58805 -2.038567
H  5.88244 0.178688 1.609888
H  1.247857 -4.158167 1.139585
H  5.077244 3.073911 -1.522705
H  -1.090047 -2.904976 -2.296295
H  6.671043 2.035319 0.135152
H  -0.396538 -4.699924 -0.663615
