program: Gaussian 09
title: 000003089
version: EM64L-G09RevD.01
frameworkgroup: C1[X(C19H25N3O2S2)]
method: RPBEPBE
basis: SDD
operation: Freq
keyword: #p
keyword: freq=noraman
keyword: PBEPBE/SDD
title: #p freq=noraman PBEPBE/SDD
converged: YES YES NO NO
title: Mulliken charges:
elementType: S S O O N N N C C C C C C C C C C C C C C C C C C C H H H H H H H H H H H H H H H H H H H H H H H H H
charge: 0.970427 0.247291 -0.546101 -0.529752 -0.282641 -0.088880 -0.234903 -0.051296 -0.450534 0.548460 0.491716 -0.411460 -0.723939 -0.325684 -0.351814 -0.125373 -0.263110 -0.329061 -0.274619 -0.627705 -0.639368 -0.261672 -0.236701 -0.250744 -0.620223 -0.614954 0.244174 0.235631 0.233229 0.199747 0.235578 0.239024 0.317276 0.260338 0.246028 0.284237 0.230065 0.194353 0.226933 0.224947 0.190545 0.235492 0.249890 0.231575 0.235980 0.275134 0.249832 0.212668 0.272376 0.207702 0.249881
chargesum: 0.00000
title: Mulliken charges with hydrogens summed into heavy atoms:
elementType: S S O O N N N C C C C C C C C C C C C C C C C C C C
charge: 0.970427 0.247291 -0.546101 -0.529752 -0.282641 -0.088880 -0.234903 0.192879 0.018326 0.548460 0.491716 -0.411460 -0.049589 -0.008407 -0.351814 -0.125373 -0.002772 -0.083033 0.009618 0.023647 0.011616 -0.011781 -0.005126 -0.014763 0.117410 0.115005
polarizability: 3.99626417e+02 -7.10924064e+00 2.75605781e+02 -2.10224411e+01 -2.78276468e+01 2.03461379e+02
1716.lowfreq: -11.5938 -2.7263 -0.0015 0.0002 0.0019 1.8375 15.2566 27.3718 35.2715
frequency: 14.3337 27.2201 35.2132 37.2300 53.4745 59.1456 66.3204 77.4598 97.4784 104.9875 122.0445 139.5207 172.3696 187.4964 196.3456 201.6801 207.0196 210.3203 220.8778 229.4194 232.0486 240.4771 250.5365 265.0900 279.8378 297.7707 302.2696 321.6926 335.3212 350.1678 355.4368 385.9496 387.3663 406.0772 413.3160 427.4322 431.4117 440.7959 448.0401 461.1455 490.2705 506.8827 530.0177 539.4048 586.7076 599.7147 625.4469 665.0825 679.7297 716.8679 728.8629 751.7677 753.6030 778.1863 807.8244 817.4912 841.3913 848.9882 859.7900 867.7868 893.8754 928.8229 936.5156 945.7811 952.6203 973.8591 975.3058 1016.7851 1019.4409 1024.9005 1041.2637 1041.3502 1065.0383 1077.0713 1080.5604 1086.1869 1086.5885 1109.2573 1110.5724 1123.5965 1126.7194 1136.1222 1142.5597 1175.4773 1176.6999 1202.0884 1208.9817 1232.4849 1241.2418 1252.4711 1273.0245 1278.6150 1308.5205 1324.3330 1342.6647 1364.6922 1375.5591 1382.9249 1386.6989 1403.8942 1408.7502 1416.7711 1424.4183 1428.5490 1444.3043 1450.6787 1454.5720 1457.0657 1464.9439 1466.1164 1468.1596 1470.3731 1474.4712 1478.6943 1480.0850 1486.3509 1487.8893 1496.1784 1544.5430 1578.2809 1582.3960 1609.3660 2857.0981 2868.0246 2912.9022 2919.0354 2958.3390 2986.5274 2994.1685 3012.0988 3019.6155 3038.8826 3040.2597 3072.8604 3076.4823 3080.8650 3088.3581 3095.5891 3097.7657 3099.5912 3135.7540 3144.8230 3151.2687 3158.7616 3161.7359 3173.0534 3176.3638
redmass: 4.3115 4.1640 3.2798 4.5048 4.1457 3.8874 3.3509 3.1544 4.9691 4.3709 3.4107 4.0154 3.9959 1.7891 1.5709 3.5284 1.7958 2.9439 1.2622 2.9456 1.0758 4.1332 1.6325 3.0196 3.2921 3.4371 4.1541 3.5012 3.5901 3.6542 5.9942 3.4378 4.1647 4.2505 7.0190 5.0483 3.1057 3.4208 3.4911 5.5738 5.9628 3.1155 3.7062 5.5473 6.1804 5.9343 5.2137 6.4677 6.3961 4.3662 3.9618 3.9303 1.3458 3.9833 10.2274 1.3661 2.3721 1.4786 4.3340 2.6150 1.3633 1.5238 1.5692 1.3709 14.4880 2.0164 1.3171 1.4386 6.2335 6.7101 2.3009 1.4767 2.2658 1.8253 1.2488 3.3913 1.2638 1.9961 1.6826 1.8664 1.7057 1.4373 1.4221 1.0655 5.1618 2.3851 1.6655 1.7211 1.9936 1.4386 2.4544 1.7636 1.9199 1.3579 1.5198 1.3488 6.1788 3.6099 1.3980 1.1357 3.5132 1.1405 1.1469 2.2753 1.1457 2.6341 1.0576 1.0555 1.0605 1.0686 1.3345 1.0951 1.4855 1.0590 1.0715 1.0547 1.1287 1.0587 6.3246 6.6237 7.5262 7.4854 1.0576 1.0578 1.0475 1.0462 1.0687 1.0387 1.0809 1.0727 1.0737 1.0862 1.0854 1.0997 1.0957 1.0944 1.0972 1.0984 1.0990 1.1004 1.0852 1.0901 1.0892 1.0938 1.0906 1.1007 1.0960
irintensity: 2.6827 1.2267 0.1686 0.6643 1.5836 0.6689 0.5102 1.2340 1.1358 0.8451 1.5141 0.7579 0.6777 0.4036 1.5271 2.7643 1.2092 1.8058 0.1982 2.5000 0.4465 5.9231 2.6488 1.3516 1.1967 1.9178 5.0377 2.1091 5.4837 3.6354 3.5389 10.8790 1.7677 14.9513 59.8617 0.8693 0.9551 5.9476 22.1025 4.2492 94.8435 1.5243 4.4608 13.1838 47.2649 9.8898 6.6789 0.8368 13.7631 2.1521 8.8015 1.1798 84.8360 16.2263 96.6794 16.0861 3.3830 1.0803 39.1276 8.2124 20.7355 2.7990 7.4647 1.7923 64.7747 15.8078 0.0959 1.8771 50.3600 4.2664 6.1898 9.7432 21.3959 53.4892 2.4866 14.6803 5.9680 0.4085 37.6730 30.8927 20.0451 1.8310 9.8434 0.3780 13.9276 51.2786 16.2650 43.1193 20.5454 5.2957 10.6250 8.1345 101.8853 2.2592 1.9266 12.0944 15.5637 25.3176 31.9226 15.7321 75.7377 4.7214 5.9985 9.4859 5.9806 346.5814 15.0540 6.4146 2.5831 1.8551 39.8502 28.8684 8.0786 7.7655 40.8437 15.5468 23.7011 11.0292 5.2999 0.7095 51.8932 35.5563 64.7697 122.1307 49.5847 67.4079 40.1371 12.6930 23.4819 46.1924 53.1868 4.0346 49.6295 27.7628 11.6540 52.6808 27.1295 1.9686 3.2508 21.7605 1.8111 6.2231 2.7744 19.1818 7.3297 21.9417 3.5534
temp: 298.150 k
press: 1.00000 atm
elementType: 16 16 8 8 7 7 7 6 6 6 6 6 6 6 6 6 6 6 6 6 6 6 6 6 6 6 1 1 1 1 1 1 1 1 1 1 1 1 1 1 1 1 1 1 1 1 1 1 1 1 1
symmnumber: 1
zpe: 1065910.4 jmol-1
zpe.correction: 0.405984 hartree
zpe.thermalcorrener: 0.433713 hartree
zpe.thermalcorrenthalpy: 0.434657 hartree
zpe.thermalcorrgfe: 0.346867 hartree
zpe.sumelectzpe: -1847.691179 hartree
zpe.sumelectthermal: -1847.663449 hartree
zpe.sumelectthermalent: -1847.662505 hartree
zpe.sumelectthermalfe: -1847.750296 hartree
dipole: 4.5107 1.9471 3.8158
dipole: 6.2208
quadrupole: -174.3448 -162.4857 -179.9598
quadrupole: -2.2940 -29.1480 -10.1876
quadrupole: -2.0813 9.7777 -7.6964 -2.2940 -29.1480 -10.1876
hfenergy: -1848.0971627 hartree
pointgroup: C01 [X(C19H25N3O2S2)]
dipole: -1.7837843 -0.727096 1.5097936 debye
polarizability: 399.2603428|-14.4304958|274.4199064|17.8486269|29.9239084|205.0133279 unknown
InChI: InChI=1S/C19H25N3O2S2/c1-14(20(2)3)13-22-16-8-6-7-9-18(16)25-19-11-10-15(12-17(19)22)26(23,24)21(4)5/h6-12,14H,13H2,1-5H3
charge 0 multiplicity 1
51 atoms
S  3.669745 0.538746 -1.021365
S  -1.956667 2.308909 1.67448
O  3.336023 -0.691737 -2.034999
O  4.49439 1.867555 -1.46171
N  -1.501794 -0.167429 -0.071429
N  -0.273523 -3.792569 0.376712
N  4.712252 -0.240665 0.360562
C  -0.577924 -2.391911 0.766148
C  -1.337347 -1.611573 -0.365932
C  -0.344872 0.641559 0.083589
C  -2.77673 0.455288 -0.281812
C  -0.409574 1.877921 0.795083
C  -1.347515 -2.307735 2.099139
C  0.907162 0.262007 -0.474012
C  -3.125885 1.638776 0.423214
C  2.009884 1.108207 -0.296346
C  0.707123 2.73154 0.897837
C  -3.716029 -0.064221 -1.213361
C  1.956471 2.349364 0.357208
C  0.796691 -3.938194 -0.627972
C  -1.421378 -4.682018 0.123468
C  -4.363708 2.277686 0.219633
C  -4.973608 0.552064 -1.391263
C  -5.306459 1.723459 -0.676573
C  5.062445 0.761673 1.391332
C  4.090927 -1.487115 0.85819
H  0.405921 -1.908699 0.924018
H  -0.835235 -1.770411 -1.343283
H  -2.347383 -2.04543 -0.440969
H  -2.374816 -2.707539 2.014068
H  -0.813057 -2.883179 2.874071
H  -1.429919 -1.256489 2.426107
H  1.023899 -0.648318 -1.068927
H  0.60322 3.690462 1.415237
H  -3.460887 -0.93959 -1.817798
H  2.832697 3.000737 0.413856
H  1.662135 -3.311189 -0.348246
H  0.500719 -3.662618 -1.670846
H  1.135768 -4.99036 -0.651621
H  -1.061441 -5.726185 0.073166
H  -1.965821 -4.47469 -0.832039
H  -2.145966 -4.621577 0.952655
H  -4.592601 3.196984 0.768844
H  -5.683769 0.123383 -2.106402
H  -6.277535 2.207746 -0.818906
H  5.399384 1.684369 0.890169
H  5.915642 0.357254 1.965896
H  4.235622 0.993031 2.100409
H  3.78063 -2.097212 -0.006054
H  3.226406 -1.326415 1.542474
H  4.871387 -2.04585 1.406101
