program: Gaussian 09
title: 000029790
version: EM64L-G09RevD.01
frameworkgroup: C1[X(C16H14N2S)]
method: RPBEPBE
basis: SDD
operation: Freq
keyword: #p
keyword: freq=noraman
keyword: PBEPBE/SDD
title: #p freq=noraman PBEPBE/SDD
converged: YES YES NO NO
title: Mulliken charges:
elementType: S N N C C C C C C C C C C C C C C C C H H H H H H H H H H H H H H
charge: 0.233199 -0.436387 -0.109126 0.555781 -0.639771 -0.585688 0.454634 0.234920 0.444788 -0.385260 -0.365906 -0.480145 -0.465327 -0.413442 -0.232572 -0.373767 -0.306217 -0.239571 -0.237638 0.257294 0.237486 0.220656 0.224008 0.223964 0.228627 0.308485 0.242969 0.235764 0.228812 0.232780 0.246907 0.228534 0.231207
chargesum: 0.00000
title: Mulliken charges with hydrogens summed into heavy atoms:
elementType: S N N C C C C C C C C C C C C C C C C
charge: 0.233199 -0.127902 -0.109126 0.555781 -0.144991 -0.585688 0.454634 0.234920 0.444788 0.059405 -0.365906 -0.027554 -0.222358 -0.177677 -0.003760 -0.140987 -0.059309 -0.011037 -0.006431
polarizability: 2.60421052e+02 2.13673790e+01 2.25027738e+02 -2.61021752e+01 1.58338634e+01 1.20591298e+02
1716.lowfreq: -12.2119 -2.9221 -1.4667 -0.0019 -0.0008 -0.0007 16.3170 41.3029 44.3296
frequency: 14.3667 41.2122 44.2320 90.2411 117.0793 128.5673 157.8832 193.3274 220.0747 248.2258 276.1983 305.4627 308.7235 396.0505 429.7194 435.0320 439.4995 470.0762 488.4161 500.9561 517.9504 561.4207 582.5649 614.8217 651.6437 679.5726 697.8686 721.4653 737.6619 740.0021 754.1300 765.7704 814.2837 828.2678 866.3129 876.3864 895.8692 912.0446 925.7168 945.6829 947.3345 976.3469 979.7807 985.0241 1018.0254 1026.5162 1039.6153 1044.0738 1078.7878 1089.6164 1098.1114 1132.8789 1164.0627 1173.1829 1176.4921 1185.2171 1210.1908 1235.2973 1253.2192 1260.9103 1276.4724 1294.3936 1309.9451 1326.2288 1375.8135 1383.8224 1411.7177 1435.0932 1437.0115 1447.8845 1458.8733 1468.5168 1480.5982 1501.0045 1572.4530 1583.1086 1593.0032 1597.1955 1607.7784 2965.9684 2997.1222 3000.6158 3036.6626 3062.1886 3064.3636 3125.1911 3129.0509 3136.6686 3139.5821 3153.4090 3161.1563 3168.2707 3577.5879
redmass: 4.5425 4.8463 4.5414 5.1027 3.9957 2.5509 3.7617 5.0547 4.2226 4.6667 4.9159 2.6824 5.2043 7.6831 2.8668 1.3198 4.8775 5.5575 5.5754 4.2620 3.9716 4.2182 3.6629 5.6254 5.5639 6.7299 4.5931 3.9154 2.0739 2.9825 3.7835 1.5109 2.1405 1.4408 1.4262 3.3227 4.4416 1.5426 3.0794 2.9561 1.3948 1.4555 2.9439 1.3252 4.9104 2.6133 5.3312 3.4429 1.6938 2.9008 1.8285 1.5494 1.1387 1.0855 1.1554 1.3123 1.1102 1.6019 1.5296 1.4744 1.5381 1.4512 1.5533 2.4898 3.5390 7.2690 3.5195 2.2324 2.1534 2.6397 1.1835 1.1028 3.2858 1.1356 6.5748 6.8113 7.2663 6.8068 6.7062 1.0641 1.0665 1.0615 1.0965 1.0994 1.1039 1.0869 1.0859 1.0905 1.0894 1.0948 1.0989 1.1005 1.0793
irintensity: 0.8887 1.2676 3.4859 2.9111 0.4710 0.5826 1.4191 0.8014 9.5842 6.2527 2.4754 7.0808 3.1175 1.2682 14.7781 111.6548 12.1918 1.3140 1.0305 3.5531 1.0289 4.3868 1.4944 8.7465 4.8191 6.0291 8.3916 1.4535 10.9699 8.4560 23.5997 104.9532 17.1502 1.8997 0.0154 1.6386 3.6015 2.1250 11.6856 12.7022 1.3111 0.7608 8.9281 0.0228 36.7909 0.9690 15.0963 7.6048 1.1351 1.7837 1.9475 2.7357 2.9589 1.8119 5.1843 7.5025 0.8412 15.5564 3.5126 7.0193 57.1320 1.2249 3.2967 2.4264 5.7432 9.6937 21.2096 61.1853 67.5669 1.0046 13.5166 0.4076 2.2261 11.9483 0.8768 37.8062 6.0481 81.5022 7.9840 60.7843 63.3000 14.9565 48.5224 5.8499 42.1443 3.3438 1.9365 12.8606 3.4255 18.2398 29.6251 29.3535 17.0590
temp: 298.150 k
press: 1.00000 atm
elementType: 16 7 7 6 6 6 6 6 6 6 6 6 6 6 6 6 6 6 6 1 1 1 1 1 1 1 1 1 1 1 1 1 1
symmnumber: 1
zpe: 680365.4 jmol-1
zpe.correction: 0.259138 hartree
zpe.thermalcorrener: 0.274744 hartree
zpe.thermalcorrenthalpy: 0.275688 hartree
zpe.thermalcorrgfe: 0.214271 hartree
zpe.sumelectzpe: -1124.357477 hartree
zpe.sumelectthermal: -1124.341870 hartree
zpe.sumelectthermalent: -1124.340926 hartree
zpe.sumelectthermalfe: -1124.402343 hartree
dipole: -1.6660 1.6944 3.0272
dipole: 3.8484
quadrupole: -110.1444 -106.8366 -120.7883
quadrupole: 5.5451 5.2431 -1.5344
quadrupole: 2.4454 5.7532 -8.1985 5.5451 5.2431 -1.5344
hfenergy: -1124.6166145 hartree
pointgroup: C01 [X(C16H14N2S1)]
dipole: 0.5248335 -0.8348117 1.1489436 debye
polarizability: 258.9900371|16.2134536|224.6243659|36.5140584|-5.646643|122.4256851 unknown
InChI: InChI=1S/C16H14N2S/c1-2-7-14-12(5-1)13-6-3-4-11(16(13)19-14)10-15-17-8-9-18-15/h1-7,17H,8-10H2
charge 0 multiplicity 1
33 atoms
S  0.300994 1.262111 -0.759703
N  -3.286209 0.142722 0.818502
N  -3.618391 1.688736 -0.860307
C  -1.235573 -1.169908 -0.907319
C  -2.416912 -0.411503 -1.495777
C  -0.025958 -0.522764 -0.5580
C  1.092021 -1.222125 -0.010495
C  -3.103535 0.524678 -0.516916
C  2.2352 -0.348037 0.255031
C  -3.878112 1.276288 1.56794
C  1.980353 1.012977 -0.09252
C  -4.272284 2.237631 0.381819
C  -1.301427 -2.566564 -0.681411
C  0.987513 -2.620022 0.202969
C  -0.207123 -3.284439 -0.131967
C  3.504213 -0.68682 0.789815
C  2.946927 2.023061 0.079468
C  4.479866 0.313708 0.966468
C  4.20376 1.661775 0.613495
H  -2.110914 0.207707 -2.358028
H  -3.165848 -1.135859 -1.867624
H  -3.136223 1.740149 2.249203
H  -4.752453 0.959812 2.163862
H  -5.367749 2.258259 0.227361
H  -3.936873 3.275097 0.55212
H  -2.735604 -0.592311 1.261454
H  -2.221984 -3.09989 -0.947162
H  1.832635 -3.177756 0.62116
H  -0.294072 -4.364623 0.02611
H  3.7248 -1.724664 1.06358
H  2.73541 3.061785 -0.193274
H  5.460138 0.051566 1.378592
H  4.971214 2.430524 0.754553
