program: Gaussian 09
title: 000029746
version: EM64L-G09RevD.01
frameworkgroup: C1[X(C12H22O)]
method: RPBEPBE
basis: SDD
operation: Freq
keyword: #pfreq=noraman
keyword: PBEPBE/SDD
title: #p freq=noraman PBEPBE/SDD
converged: NO YES NO NO
title: Mulliken charges:
elementType: O C C C C C C C C C C C C H H H H H H H H H H H H H H H H H H H H H H
charge: -0.485293 0.372680 0.253324 -0.052233 -0.449170 -0.492819 -0.543731 -0.449444 -0.416946 -0.416577 -0.378187 -0.826478 -0.824390 0.206981 0.191537 0.215637 0.230246 0.190791 0.209221 0.196242 0.197378 0.195840 0.190771 0.220647 0.198160 0.196968 0.193033 0.202525 0.229795 0.217498 0.218110 0.231530 0.213342 0.228618 0.334392
chargesum: 0.00000
title: Mulliken charges with hydrogens summed into heavy atoms:
elementType: O C C C C C C C C C C C C
charge: -0.150901 0.372680 0.253324 0.154749 -0.041996 -0.071782 -0.138268 -0.056226 -0.005528 -0.021449 0.017371 -0.161075 -0.150900
polarizability: 1.36866896e+02 -6.05595934e-01 1.27230968e+02 1.39608402e-01 2.99415654e-01 1.10829449e+02
1716.lowfreq: -20.7184 -17.4742 -0.0006 -0.0005 0.0003 23.7564 95.1230 126.0410 169.9045
frequency: 95.0408 125.9851 169.9026 191.7475 210.4048 238.6922 254.8946 281.2546 295.4039 301.9050 330.3367 343.1528 357.7075 372.0094 380.8971 417.8447 444.3195 468.9981 488.5462 510.4881 559.2088 615.8541 664.8473 777.0612 797.0072 802.9615 829.1031 844.5523 864.9849 874.8650 908.4762 934.3760 939.0270 959.9202 978.7308 990.7177 1006.1967 1019.4402 1028.6818 1046.2961 1074.1134 1098.7263 1109.6309 1130.9486 1140.1683 1152.7911 1167.4146 1171.6293 1178.7259 1214.6523 1225.0225 1252.8469 1262.6092 1293.7493 1296.7609 1305.1756 1319.1935 1329.1533 1333.4638 1339.7388 1341.1135 1345.5034 1352.7440 1357.5266 1384.5422 1394.4314 1451.3841 1457.6995 1459.7644 1463.6391 1469.8224 1472.4267 1479.9481 1484.1549 1485.4340 1487.0278 1498.1492 2962.1723 2964.8886 2967.1955 2968.9456 2970.6278 2977.0934 2979.7892 2983.0815 2986.5597 2994.8080 3017.2387 3022.3699 3022.6176 3030.4737 3040.6467 3050.6545 3057.7035 3061.0975 3068.3990 3070.4201 3089.1027 3561.3212
redmass: 2.5803 2.1930 2.0529 1.7807 1.6727 2.0885 1.1527 3.7672 2.3908 2.0640 2.3484 2.4652 1.6708 2.1456 1.8744 2.5540 2.6914 3.0893 2.5693 1.8628 2.6708 2.4694 2.7939 2.3111 1.5578 2.6308 1.6846 2.3212 2.4278 1.8640 1.9527 1.7251 1.9635 1.6973 1.6882 1.8738 1.7453 1.6842 1.8577 2.2502 1.6039 1.7818 1.8830 1.3149 2.4833 1.9613 2.0088 2.1943 1.6801 1.4108 1.5352 1.3857 1.2217 1.4826 1.4060 1.6171 1.3732 1.4545 1.3966 1.4379 1.4763 1.3999 1.3446 1.4728 1.2172 1.2112 1.0835 1.0800 1.0808 1.0771 1.0770 1.0795 1.0752 1.0613 1.0592 1.0602 1.0641 1.0646 1.0670 1.0616 1.0441 1.0591 1.0586 1.0674 1.0501 1.0557 1.0647 1.0979 1.0988 1.0998 1.0986 1.1011 1.1008 1.0985 1.1007 1.0966 1.0983 1.0973 1.0654
irintensity: 0.0618 0.0268 0.1672 0.5446 0.5417 1.2365 13.8349 16.6055 6.1878 30.4994 9.4280 1.8811 34.4239 23.3736 15.5176 4.3251 0.9533 3.2423 4.8373 0.3208 3.8624 4.5164 2.5156 7.7063 3.5714 1.8355 0.2899 3.8536 5.0983 16.2983 15.3680 15.3564 5.0141 3.0074 13.0460 6.3119 13.4728 9.9614 4.1190 6.6075 9.1846 1.1599 3.9962 6.1461 6.0037 12.1077 7.0018 2.1416 0.6205 5.1693 5.3099 0.7742 2.7667 0.6850 9.4740 3.6088 4.3388 3.8360 0.4614 0.2500 0.7097 2.8151 0.2069 6.1602 27.4173 13.7231 4.0605 4.6185 7.8986 4.9634 6.4754 12.9611 23.7665 8.7366 7.2416 3.6076 8.0518 21.9715 10.3603 21.3288 44.9784 6.5189 47.5353 68.3304 62.8251 51.3149 58.3267 34.4548 74.6560 26.4133 18.6446 9.6590 72.2595 51.4398 58.7655 33.8240 47.9192 34.6277 1.8018
temp: 298.150 k
press: 1.00000 atm
elementType: 8 6 6 6 6 6 6 6 6 6 6 6 6 1 1 1 1 1 1 1 1 1 1 1 1 1 1 1 1 1 1 1 1 1 1
symmnumber: 1
zpe: 833503.3 jmol-1
zpe.correction: 0.317465 hartree
zpe.thermalcorrener: 0.330559 hartree
zpe.thermalcorrenthalpy: 0.331503 hartree
zpe.thermalcorrgfe: 0.280378 hartree
zpe.sumelectzpe: -544.633149 hartree
zpe.sumelectthermal: -544.620055 hartree
zpe.sumelectthermalent: -544.619111 hartree
zpe.sumelectthermalfe: -544.670236 hartree
dipole: -0.2493 1.1234 1.0343
dipole: 1.5473
quadrupole: -82.3345 -79.1960 -83.8354
quadrupole: -0.8191 0.0950 -1.6380
quadrupole: -0.5459 2.5926 -2.0468 -0.8191 0.0950 -1.6380
hfenergy: -544.950614 hartree
pointgroup: C01 [X(C12H22O1)]
dipole: 0.0935279 -0.4573791 0.3906689 debye
polarizability: 136.8347983|-0.7791167|127.2584062|-0.4244443|0.271158|110.8341089 unknown
InChI: InChI=1S/C12H22O/c1-10-6-5-8-11(2)7-3-4-9-12(10,11)13/h10,13H,3-9H2,1-2H3
charge 0 multiplicity 1
35 atoms
O  0.126228 -0.725152 -1.523249
C  -0.387152 0.939987 0.151972
C  0.050207 -0.55494 -0.038344
C  1.45562 -0.845362 0.607928
C  0.649734 1.891873 -0.544177
C  -1.790218 1.144488 -0.50026
C  -1.029295 -1.53725 0.499227
C  2.43595 0.367893 0.497673
C  2.079491 1.301152 -0.680526
C  -2.869833 0.175996 0.036856
C  -2.419177 -1.293831 -0.134983
C  -0.4769 1.301441 1.665365
C  2.114713 -2.11589 0.012464
H  1.266525 -1.046378 1.682564
H  0.688158 2.837606 0.03345
H  0.279357 2.152395 -1.552913
H  -1.686528 0.988296 -1.590415
H  -2.104574 2.196621 -0.344831
H  -1.098625 -1.44019 1.60039
H  -0.706527 -2.580805 0.303562
H  3.469411 -0.011501 0.37428
H  2.43615 0.953155 1.438027
H  2.820556 2.121393 -0.750407
H  2.137311 0.72284 -1.619895
H  -3.822238 0.344188 -0.502847
H  -3.076843 0.3817 1.106448
H  -3.160552 -1.983363 0.314145
H  -2.367715 -1.527067 -1.216303
H  0.503666 1.256245 2.168968
H  -0.848726 2.338448 1.766425
H  -1.170589 0.648307 2.222961
H  2.996617 -2.401755 0.613754
H  1.43463 -2.98948 0.000302
H  2.468517 -1.931276 -1.019405
H  0.308254 -1.680884 -1.710506
