program: Gaussian 09
title: 000029735
version: EM64L-G09RevD.01
frameworkgroup: C1[X(C12H12O4)]
method: RPBEPBE
basis: SDD
operation: Freq
keyword: #pfreq=noraman
keyword: PBEPBE/SDD
title: #p freq=noraman PBEPBE/SDD
converged: NO YES NO NO
title: Mulliken charges:
elementType: O O O O C C C C C C C C C C C C H H H H H H H H H H H H
charge: -0.298069 -0.427369 -0.369424 -0.197107 0.109389 0.185546 0.005044 0.221848 0.065694 -0.020250 0.355240 -0.500576 -0.845427 -0.798718 0.094324 -0.797613 0.265696 0.249708 0.239455 0.239527 0.257765 0.244948 0.244985 0.371054 0.371592 0.236200 0.236255 0.260284
chargesum: 0.00000
title: Mulliken charges with hydrogens summed into heavy atoms:
elementType: O O O O C C C C C C C C C C C C
charge: -0.298069 -0.056315 0.002168 -0.197107 0.109389 0.185546 0.005044 0.221848 0.065694 -0.020250 0.355240 -0.234879 -0.116738 -0.051020 0.094324 -0.064874
polarizability: 2.30028393e+02 -3.83694336e+00 1.60833948e+02 1.44979067e-02 -3.33545351e-03 7.14563172e+01
1716.lowfreq: -109.8041 -2.6303 -0.0009 -0.0008 -0.0002 1.9156 8.2284 28.0612 58.2213
frequency: -109.8030 28.0428 58.2102 106.1921 137.9445 149.4349 150.1939 170.3535 195.6305 207.5302 227.9447 232.3128 293.0330 295.1067 308.9041 317.2294 344.3075 393.7591 407.4487 416.5060 458.8266 534.6842 537.8035 544.4822 569.5506 609.9923 620.5823 657.2691 680.8360 687.8676 730.1892 781.6555 850.0436 872.9821 926.4257 946.4872 985.2596 1020.7617 1033.9771 1039.3738 1045.5582 1098.7942 1130.3491 1144.6678 1174.3103 1202.6406 1246.8233 1281.1742 1303.5682 1365.5706 1367.6844 1394.9866 1404.5096 1408.4900 1450.6248 1454.0892 1463.3123 1465.6960 1468.0059 1481.5763 1481.9641 1494.8282 1569.7899 1606.1236 1620.7686 1647.9806 2960.1926 2984.4580 2986.9582 3030.8124 3063.4204 3071.1448 3081.1829 3106.2503 3123.2753 3186.8597 3511.9066 3597.6543
redmass: 1.0187 4.5893 4.6041 3.3979 5.3045 4.3482 1.1596 2.7067 1.0547 5.0398 1.2985 2.6436 5.7911 4.3634 5.1151 4.5453 3.7997 6.4524 4.8243 1.1209 7.7899 4.0600 5.1726 4.4811 4.0503 4.9222 4.2514 6.0846 5.4154 4.9620 4.7801 4.6101 5.1510 1.5115 2.8150 2.0353 2.3880 1.8090 1.3809 3.5052 1.4934 2.1822 2.4993 1.6566 2.3791 3.5986 2.2537 2.0851 7.0740 1.5879 1.9230 3.9318 1.6376 1.2583 2.9265 1.1414 1.0436 1.1501 1.0500 1.1101 1.0441 4.6339 7.4956 8.6989 8.2940 8.1061 1.0392 1.0371 1.0382 1.0988 1.0985 1.0975 1.0949 1.0973 1.0992 1.0900 1.0656 1.0662
irintensity: 0.0669 5.9032 0.0321 0.2471 0.5549 1.2619 10.1580 1.0290 3.4121 4.2844 108.5107 0.2786 1.7706 4.3072 2.4386 2.0936 10.4545 6.6699 4.9263 135.3728 2.0443 0.1871 8.7213 12.3647 6.6499 0.6468 14.6644 34.4691 0.4130 39.0409 0.3537 2.3542 20.1140 20.2239 45.2866 19.6938 21.5161 2.5940 6.0270 54.3815 0.0010 3.4228 50.4080 80.4472 238.3601 2.1703 201.9274 71.9997 131.7051 2.0672 81.6779 23.6869 55.7985 12.5255 16.9528 55.4539 28.1941 8.7307 19.2197 18.7972 4.0222 78.0138 224.8245 41.5995 40.7284 4.6943 33.0813 5.2081 22.6905 18.0309 12.0574 14.6156 16.7506 5.8269 17.7591 2.1112 44.0729 39.5931
temp: 298.150 k
press: 1.00000 atm
elementType: 8 8 8 8 6 6 6 6 6 6 6 6 6 6 6 6 1 1 1 1 1 1 1 1 1 1 1 1
symmnumber: 1
zpe: 556306.2 jmol-1
zpe.correction: 0.211886 hartree
zpe.thermalcorrener: 0.227296 hartree
zpe.thermalcorrenthalpy: 0.228240 hartree
zpe.thermalcorrgfe: 0.169528 hartree
zpe.sumelectzpe: -764.193045 hartree
zpe.sumelectthermal: -764.177635 hartree
zpe.sumelectthermalent: -764.176690 hartree
zpe.sumelectthermalfe: -764.235403 hartree
dipole: 7.4604 2.2473 0.0003
dipole: 7.7916
quadrupole: -85.4608 -93.0982 -94.8058
quadrupole: -11.0917 0.0034 0.0009
quadrupole: 5.6608 -1.9766 -3.6842 -11.0917 0.0034 0.0009
hfenergy: -764.4049304 hartree
pointgroup: C01 [X(C12H12O4)]
dipole: -2.9452981 0.8497641 -0.0001125 debye
polarizability: 229.9291264|4.6455336|160.9332146|0.0144579|0.0035049|71.4563172 unknown
InChI: InChI=1S/C12H12O4/c1-5-7(3)16-12-10(5)9(14)4-8(6(2)13)11(12)15/h4,14-15H,1-3H3
charge 0 multiplicity 1
28 atoms
O  -1.52858 -1.661033 0.000326
O  -0.446555 3.034349 0.000426
O  1.280538 -2.393693 0.000692
O  3.809644 -1.342066 0.000239
C  -1.012906 0.597614 0.000371
C  -2.467498 0.456114 0.000196
C  -0.481147 -0.711722 0.000451
C  -2.737988 -0.903959 0.000159
C  -0.079386 1.672311 0.000508
C  0.882335 -1.057135 0.000648
C  1.80971 0.03216 0.000787
C  1.289468 1.370252 0.000693
C  -3.496729 1.55864 0.000023
C  -4.004366 -1.701466 -0.000076
C  3.293712 -0.186654 0.000984
C  4.205281 1.046157 0.000213
H  1.982407 2.214317 0.000778
H  -4.520789 1.14848 0.000364
H  -3.410215 2.203386 0.897004
H  -3.41054 2.202784 -0.897418
H  -3.769115 -2.778054 0.00109
H  -4.621107 -1.487001 0.891786
H  -4.619779 -1.488676 -0.893264
H  -1.429206 3.139708 0.000385
H  0.47509 -2.976651 0.000667
H  4.036793 1.676705 0.892823
H  4.035842 1.676349 -0.892474
H  5.248883 0.696783 -0.000281
