program: Gaussian 09
title: 000032942
version: EM64L-G09RevD.01
frameworkgroup: C1[X(C22H27NO2)]
method: RPBEPBE
basis: SDD
operation: Freq
keyword: #p
keyword: freq=noraman
keyword: PBEPBE/SDD
title: #p freq=noraman PBEPBE/SDD
converged: YES YES NO NO
title: Mulliken charges:
elementType: O O N C C C C C C C C C C C C C C C C C C C C C C H H H H H H H H H H H H H H H H H H H H H H H H H H H
charge: -0.234864 -0.265214 -0.108853 -0.156112 0.249356 0.338612 -0.404154 0.148200 0.152116 0.272538 -0.414371 -0.433198 -0.703331 -0.409980 -0.409477 -0.247851 -0.253441 -0.233685 -0.238513 -0.322473 -0.332118 -0.313469 -0.312820 -0.687832 -0.667389 0.214363 0.237486 0.273724 0.252473 0.213383 0.233192 0.231396 0.240673 0.239931 0.225476 0.223557 0.224635 0.224264 0.233994 0.225062 0.219742 0.186057 0.184870 0.214957 0.185492 0.207267 0.198139 0.258266 0.205221 0.209242 0.217676 0.207789
chargesum: 0.00000
title: Mulliken charges with hydrogens summed into heavy atoms:
elementType: O O N C C C C C C C C C C C C C C C C C C C C C C
charge: -0.234864 -0.265214 -0.108853 -0.156112 0.249356 0.338612 0.047694 0.148200 0.152116 0.272538 -0.140647 -0.180725 -0.025360 -0.169308 -0.169547 -0.022375 -0.029884 -0.009050 -0.014250 0.136582 0.073681 0.086358 0.079939 -0.026205 -0.032681
polarizability: 2.85526458e+02 1.70982414e+01 2.91379395e+02 1.99184546e+01 -5.40465900e+00 1.77138437e+02
1716.lowfreq: -8.1706 -2.0682 -0.0008 -0.0007 -0.0006 6.4114 8.6484 29.2778 41.1560
frequency: 7.9238 29.2358 41.1257 50.4385 58.5438 80.0877 84.7718 90.6271 93.7868 103.7208 126.2363 139.3300 158.2796 181.4303 188.4420 205.2394 212.3663 234.2617 267.3752 269.0098 277.6084 296.7949 306.8149 324.2622 327.7522 354.7800 384.9813 408.3108 422.9260 423.8912 454.2098 457.9838 480.2356 510.2674 530.5825 554.7393 570.6845 608.3631 618.8325 669.2177 690.3890 701.7733 723.4021 746.5660 753.4835 757.8119 766.7125 773.4907 793.1256 795.0034 801.2347 809.5172 877.1570 881.9333 888.5709 909.1548 917.8451 935.1529 937.3644 951.2801 957.1484 983.8175 987.7811 995.7810 997.7312 1021.4231 1022.4692 1028.7710 1054.0937 1067.7023 1074.4680 1082.3639 1084.6872 1089.1418 1096.5218 1108.7561 1115.0477 1121.0100 1161.0462 1168.9659 1171.7984 1182.2082 1186.8955 1207.0842 1214.0416 1241.1282 1249.5209 1264.7618 1269.7799 1284.7457 1294.7510 1299.0592 1304.7039 1326.9805 1350.0565 1362.3098 1370.6574 1377.5000 1377.7702 1386.4787 1387.0900 1393.0101 1403.7564 1437.1734 1443.0120 1449.9805 1451.7557 1464.1486 1466.5121 1468.8505 1471.4493 1473.6608 1476.3365 1479.5512 1483.9863 1486.4893 1487.2467 1489.8510 1591.4159 1592.1142 1608.7439 1615.8936 1621.8242 2828.1785 2851.5800 2863.1898 2979.9575 2983.3818 2985.7272 2989.1106 3030.7594 3042.3107 3046.6082 3049.7094 3050.6819 3073.7945 3075.7857 3078.9568 3084.3086 3089.4052 3101.0425 3103.3200 3121.5491 3123.0922 3132.4856 3134.6071 3146.2554 3147.3833 3160.8700 3162.0852
redmass: 4.3383 4.0218 3.8427 4.6707 3.9618 3.4082 2.1314 3.2108 2.3496 4.2479 2.7021 4.0677 3.5647 1.7169 1.7201 2.0856 1.5569 3.6077 1.6990 2.6257 2.1520 2.1189 3.3534 3.4144 2.7745 3.4671 4.6606 5.6104 3.0405 2.6718 3.8669 2.5353 3.1487 5.1979 2.9810 3.5251 3.3774 4.9226 6.3930 5.1583 7.3352 2.9960 5.0232 2.3402 1.5699 3.8755 1.9065 1.4406 1.2193 1.1603 2.5832 2.6324 1.4043 2.0536 1.8297 1.9602 1.9979 2.5020 2.1724 1.5084 1.6187 1.3284 1.3493 5.6851 3.7940 2.2387 2.1925 2.0802 2.6934 2.1672 1.9600 2.3441 2.7071 2.1247 1.8558 1.9210 1.5711 1.8681 2.9897 1.2013 1.2101 2.1104 2.0804 2.2745 3.1548 1.8758 1.2125 1.2724 1.2757 1.1646 1.2385 1.4858 1.9044 1.4272 1.3333 1.3348 1.3074 5.9938 1.4818 1.2329 1.2320 1.2131 3.8282 2.2492 2.6920 1.0861 1.0901 1.0625 2.1722 1.1630 1.0732 1.0626 1.0433 1.0468 2.9237 1.0726 1.1456 1.0818 6.9377 6.8455 8.5628 7.7933 7.3166 1.0714 1.0723 1.0715 1.0353 1.0361 1.0397 1.0574 1.0588 1.0864 1.0878 1.0856 1.0994 1.0976 1.0976 1.0990 1.1004 1.1008 1.1004 1.1069 1.0850 1.0852 1.0896 1.0896 1.0946 1.0945 1.1001 1.1002
irintensity: 0.5957 0.4404 0.6343 0.0330 0.0467 0.6864 0.2011 0.5220 0.6213 1.8104 0.7404 1.1313 1.7973 0.3538 0.0783 0.2517 0.2656 0.1323 0.9565 2.1074 0.8452 0.8918 0.8093 3.6597 8.8411 0.3035 18.6895 1.1605 7.6095 0.4450 0.2226 3.6617 0.2490 0.3791 5.3759 14.6511 0.1266 2.3667 7.3056 17.8157 4.7772 10.7101 1.3004 68.4687 1.8120 18.0907 64.8314 7.8899 9.1113 8.4908 1.8829 3.3534 0.7598 2.2883 2.9565 4.3133 1.7520 12.5438 3.0108 1.5360 1.0708 0.1699 0.6310 6.0227 56.8120 18.0615 17.8912 8.8185 2.0374 8.5868 26.2305 9.6278 11.6066 10.2888 0.0719 28.9714 3.4737 9.7510 245.3463 11.3558 45.6190 21.0820 9.7598 22.7428 20.0756 5.5178 17.6715 14.8766 1.8596 8.7169 13.9094 2.7259 2.5747 3.2224 5.5061 1.0338 1.9333 7.9789 0.9286 25.2715 16.5126 13.2867 1.0568 29.7325 15.7888 1.7178 9.9413 2.2897 13.7949 7.2303 11.2568 12.3922 7.1516 1.7611 1.7593 8.8842 10.8272 27.8116 3.7944 1.9078 115.4575 17.2814 14.5451 82.1530 33.4586 283.5409 25.5270 32.0300 37.5011 24.3456 36.0267 3.1214 13.8361 16.5456 4.1868 35.7807 92.0763 38.2738 45.1236 29.7663 38.4646 11.5541 1.4377 0.9483 12.6544 4.2808 3.9816 45.3206 47.8656 18.2991
temp: 298.150 k
press: 1.00000 atm
elementType: 8 8 7 6 6 6 6 6 6 6 6 6 6 6 6 6 6 6 6 6 6 6 6 6 6 1 1 1 1 1 1 1 1 1 1 1 1 1 1 1 1 1 1 1 1 1 1 1 1 1 1 1
symmnumber: 1
zpe: 1146246.1 jmol-1
zpe.correction: 0.436582 hartree
zpe.thermalcorrener: 0.461229 hartree
zpe.thermalcorrenthalpy: 0.462174 hartree
zpe.thermalcorrgfe: 0.380657 hartree
zpe.sumelectzpe: -1057.893641 hartree
zpe.sumelectthermal: -1057.868993 hartree
zpe.sumelectthermalent: -1057.868049 hartree
zpe.sumelectthermalfe: -1057.949566 hartree
dipole: 1.6467 1.2188 -0.7685
dipole: 2.1880
quadrupole: -131.6470 -144.1066 -147.5275
quadrupole: 2.8571 -0.2409 -0.0491
quadrupole: 9.4467 -3.0129 -6.4338 2.8571 -0.2409 -0.0491
hfenergy: -1058.3302229 hartree
pointgroup: C01 [X(C22H27N1O2)]
dipole: -0.7649925 -0.0016783 -0.3947444 debye
polarizability: 282.1544095|41.1618677|201.5172707|0.0112519|35.5786292|270.3726089 unknown
InChI: InChI=1S/C22H27NO2/c1-4-22(21(24)25-16-15-23(5-2)6-3)19-13-9-7-11-17(19)18-12-8-10-14-20(18)22/h7-14H,4-6,15-16H2,1-3H3
charge 0 multiplicity 1
52 atoms
O  -1.113772 1.347585 -0.554739
O  -0.592022 1.250583 1.715892
N  -3.669025 0.283881 0.666498
C  0.78772 -0.030444 0.126728
C  2.112105 0.748598 0.279127
C  0.832778 -0.438043 -1.349218
C  0.724141 -1.276075 1.086351
C  2.838163 0.732367 -0.94717
C  2.051341 -0.008653 -1.951178
C  -0.373072 0.902134 0.53098
C  2.624579 1.393903 1.415787
C  -0.1020 -1.183175 -2.086349
C  1.879374 -2.278192 0.899749
C  4.098415 1.362808 -1.03648
C  2.333563 -0.313433 -3.30092
C  3.890776 2.026195 1.324772
C  0.180489 -1.492849 -3.43977
C  4.620334 2.008408 0.109508
C  1.388478 -1.059331 -4.042549
C  -2.29991 2.197586 -0.258837
C  -3.582312 1.355509 -0.348675
C  -3.95544 0.794342 2.036985
C  -4.59219 -0.809092 0.254051
C  -3.460466 -0.156072 3.142836
C  -3.974057 -1.768572 -0.780658
H  -0.246842 -1.783657 0.92011
H  0.709699 -0.891826 2.122624
H  2.048696 1.420372 2.346973
H  -1.042884 -1.507973 -1.63028
H  1.7745 -3.111589 1.618172
H  2.858866 -1.799339 1.075667
H  1.886749 -2.705575 -0.118467
H  4.666308 1.356077 -1.973693
H  3.26814 0.015967 -3.768876
H  4.307814 2.536686 2.200104
H  -0.541812 -2.069406 -4.028921
H  5.59713 2.502736 0.057897
H  1.590082 -1.307382 -5.090863
H  -2.164209 2.664959 0.731513
H  -2.297184 2.970219 -1.045768
H  -3.611499 0.891133 -1.350424
H  -4.449633 2.067065 -0.298225
H  -5.047432 1.006458 2.166566
H  -3.426388 1.75535 2.160534
H  -5.556568 -0.39781 -0.140015
H  -4.84961 -1.388646 1.158325
H  -3.939421 -1.1508 3.086698
H  -2.368732 -0.283619 3.052927
H  -3.685258 0.267342 4.13973
H  -3.691175 -1.24677 -1.713194
H  -3.066524 -2.238998 -0.362129
H  -4.694101 -2.564841 -1.047106
