program: Gaussian 09
title: 000029754
version: EM64L-G09RevD.01
frameworkgroup: C1[X(C10H7I3N2O4)]
method: RPBEPBE
basis: SDD
operation: Freq
keyword: #p
keyword: freq=noraman
keyword: PBEPBE/SDD
title: #p freq=noraman PBEPBE/SDD
converged: YES YES NO NO
title: Mulliken charges:
elementType: I I I O O O O N N C C C C C C C C C C H H H H H H H
charge: 0.163324 0.186622 0.175914 -0.360725 -0.178188 -0.203882 -0.201841 -0.502039 -0.474396 0.825858 0.779927 0.695521 -0.738835 -0.740190 -0.772830 -0.026571 0.222555 -0.771370 -0.034692 0.316044 0.327252 0.258919 0.266462 0.221481 0.171955 0.393724
chargesum: 0.00000
title: Mulliken charges with hydrogens summed into heavy atoms:
elementType: I I I O O O O N N C C C C C C C C C C
charge: 0.163324 0.186622 0.175914 0.032999 -0.178188 -0.203882 -0.201841 -0.185994 -0.147143 0.825858 0.779927 0.695521 -0.738835 -0.740190 -0.772830 -0.026571 0.222555 -0.024508 0.137263
polarizability: 2.77684101e+02 -1.94890792e+00 2.61176291e+02 2.18629569e-01 -8.91230086e-01 1.14090814e+02
1716.lowfreq: -5.3681 -2.1146 -0.0002 0.0002 0.0003 0.9130 28.0204 34.3660 43.5501
frequency: 27.9386 34.3377 43.5328 47.9507 52.3373 52.7335 67.5242 75.0781 88.2411 96.7565 104.8382 125.6932 127.2900 158.7101 164.3147 188.5891 212.9522 225.6636 273.2869 293.6317 332.0496 350.4008 366.4733 417.8192 460.1031 513.0327 531.1449 535.4284 552.4169 569.1424 604.3698 611.4335 620.3200 628.7824 653.1478 718.4043 731.4880 774.8919 849.5766 898.8424 913.3572 965.4696 975.0455 1007.8699 1029.9794 1036.4341 1063.7325 1137.5465 1218.3804 1251.0000 1304.1336 1338.1881 1352.9915 1363.5509 1381.1912 1383.8146 1437.5800 1444.1596 1458.0890 1468.7759 1529.4131 1534.5946 1647.0798 1649.8003 1657.1469 2941.1980 2990.5089 3077.9823 3127.7297 3501.4654 3503.8575 3510.7461
redmass: 7.8882 9.2096 8.5442 10.3625 5.7006 6.2141 1.2683 3.4585 15.2949 38.8687 24.7296 9.7150 11.4573 10.7320 46.1944 3.7040 6.5894 6.1727 6.9244 6.2384 6.5421 5.0133 6.1443 9.5349 4.3077 2.5492 1.5614 1.4868 2.8257 3.1306 4.6631 3.8266 3.5178 3.3791 5.3227 7.3435 9.0087 10.3398 9.2265 8.5153 4.3516 1.6229 2.5964 4.1295 5.2580 1.7014 2.7373 3.0626 2.6169 2.4672 8.0903 4.9050 3.2190 7.6607 1.3669 1.2548 1.4565 1.7597 1.3693 1.0872 9.8512 7.5858 10.1574 6.8654 6.0899 1.0876 1.0379 1.0985 1.0985 1.0640 1.0771 1.0765
irintensity: 1.2004 2.5287 4.1722 1.8541 1.5861 1.1968 0.3374 5.3611 5.0911 2.1009 3.4321 1.7085 2.1561 1.0275 0.1773 12.7226 6.8237 4.2742 3.6532 4.2217 1.3932 4.7366 1.1502 1.6289 23.3064 14.8549 92.1756 60.7926 60.6970 23.2914 39.4206 22.7571 67.3631 17.4138 21.9468 36.5694 4.8393 29.4786 21.3599 18.0536 16.3594 1.1616 38.3862 70.6404 16.0263 12.4184 234.6548 43.3771 127.0550 17.0622 56.0438 8.6965 87.2948 222.1113 49.0159 61.2088 180.9938 235.5986 102.3061 27.7998 4.0191 30.9960 237.3031 91.6314 251.5087 120.0350 8.1745 12.9837 7.1054 43.9278 24.2887 24.0818
temp: 298.150 k
press: 1.00000 atm
elementType: 53 53 53 8 8 8 8 7 7 6 6 6 6 6 6 6 6 6 6 1 1 1 1 1 1 1
symmnumber: 1
zpe: 415005.4 jmol-1
zpe.correction: 0.158067 hartree
zpe.thermalcorrener: 0.179118 hartree
zpe.thermalcorrenthalpy: 0.180062 hartree
zpe.thermalcorrgfe: 0.102164 hartree
zpe.sumelectzpe: -828.805366 hartree
zpe.sumelectthermal: -828.784316 hartree
zpe.sumelectthermalent: -828.783372 hartree
zpe.sumelectthermalfe: -828.861269 hartree
dipole: 0.2876 1.3054 -4.8320
dipole: 5.0135
quadrupole: -123.9792 -142.4992 -169.4825
quadrupole: 0.9042 -6.8827 -16.9160
quadrupole: 21.3411 2.8211 -24.1622 0.9042 -6.8827 -16.9160
hfenergy: -828.9634335 hartree
pointgroup: C01 [X(C10H7I3N2O4)]
dipole: 0.0186037 0.2455984 -1.9570064 debye
dipolederiv: -0.0522325 -0.2426205 0.0512875 -0.1954779 -0.2991103 0.1001856 0.0815406 0.1546452 0.0215878 -0.0964134 0.2540375 0.0294961 0.2573507 -0.3096781 0.0236445 0.0196677 -0.021984 0.0786218 -0.4888958 0.0512589 0.0700694 0.0626821 0.0479624 0.0107946 0.0531788 0.0121505 0.0549249 -0.3676444 -0.0123392 0.1238763 -0.0144263 -0.4102368 0.2959158 0.1464179 0.3210624 -1.1079513 -0.492707 -0.2462681 -0.1731159 -0.254814 -0.6991176 -0.2220185 -0.0276798 0.0133518 -0.751212 -0.5816934 -0.0188911 0.1330077 0.0936417 -0.3085691 0.1637874 -0.3162747 0.1331506 -0.8903197 -0.3574492 -0.1815322 -0.3173376 0.0893504 -0.5161935 -0.08172 -0.0465631 -0.4842373 -0.8232327 -1.3995105 0.1303139 -0.415282 0.1662079 -0.4300483 -0.0348675 -0.5641341 0.0533396 -0.6466553 -0.3880738 0.1201358 0.192177 0.1899254 -1.1472784 -0.3612018 0.1844091 -0.4402507 -0.6110851 0.7515901 -0.0656707 0.2059534 0.1368185 -0.4548027 0.1741027 -0.0991506 0.1548182 0.0641901 -0.1817533 -0.4193344 -0.0106465 -0.3329625 0.3155469 0.1258185 0.1006438 -0.0187357 0.0686724 -0.5345687 0.1260978 0.0734079 0.0964605 -0.4439084 0.0454211 0.0839999 -0.0035348 0.0401845 0.1081536 0.4454442 -0.2125199 0.4056553 0.678808 -0.308155 -0.2749742 -0.226664 -0.0773656 0.2486267 -0.356952 -0.1009935 -0.4942469 0.8276339 -0.0104756 0.1079018 -0.0138171 -0.1485241 1.017883 -0.0747348 -0.1360525 -0.0225267 0.0024865 -0.0909749 -0.1532071 -0.0513505 -0.1667472 0.6614275 0.420434 0.061289 0.4278229 1.0892056 -0.0675427 -0.0819524 -0.2770786 1.5616598 1.5499336 -0.0735612 0.2082031 -0.4714689 0.2099563 -0.3400795 0.806902 -0.2379424 1.3297461 -0.4629076 0.0046948 0.0591387 0.1206962 0.0570041 -0.0225404 0.1087855 -0.0116877 -0.0245761 0.3308078 0.0719493 0.4287742 -0.389402 1.2938293 0.5188922 0.1030221 0.8857182 1.1805371 0.1132853 -0.0376411 -0.0105191 0.046628 0.2725332 0.1196602 0.0425523 0.0442505 0.2011296 0.2121701 0.0238058 -0.0990595 0.0900183 0.0925517 -0.0745901 -0.0639239 -0.0263664 0.2377318 0.0674379 -0.0005386 0.0154442 0.0510243 -0.0437755 -0.060978 0.0385815 -0.0492924 0.0912125 0.0470744 -0.0198278 -0.0435413 -0.058347 0.1098471 -0.0200904 -0.0993452 -0.0329419 -0.0130639 0.0772787 0.0181546 -0.007396 -0.0603586 -0.0016058 0.1271548 0.0435111 0.1149351 -0.0154266 -0.0590725 0.1725607 -0.0964035 0.1503785 -0.111469 0.0288116 -0.1309415 0.1058845 0.0119759 0.2772534 -0.0889756 -0.0292571 -0.0906301 0.1784285 -0.0389547 -0.0629674 -0.0974231 0.3339853 unknown
polarizability: 275.9962773|-5.4787359|259.2168424|-12.2830419|-19.4442353|117.7380861 unknown
InChI: InChI=1S/C10H7I3N2O4/c1-3(17)15-9-6(12)4(10(18)19)5(11)8(7(9)13)14-2-16/h2,14-15,18H,1H3
charge 0 multiplicity 1
26 atoms
I  1.390488 2.972659 -1.255916
I  1.417555 -3.093815 -0.244632
I  -3.858038 0.033813 0.059932
O  -1.829296 -2.806307 1.492269
O  -2.285943 -3.217058 -0.752906
O  3.010219 -0.644002 1.552305
O  -1.094761 3.53218 1.26822
N  2.513866 -0.006604 -0.645279
N  -1.800151 2.428815 -0.69237
C  1.098265 -0.016171 -0.515243
C  -1.059977 1.216435 -0.540063
C  -1.023071 -1.215923 -0.100813
C  0.351499 1.184882 -0.691185
C  0.384495 -1.2208 -0.260187
C  -1.729921 0.001484 -0.228353
C  -1.771798 -2.506711 0.135189
C  3.406652 -0.298198 0.410642
C  4.875645 -0.198383 0.019617
C  -1.794066 3.481686 0.231142
H  2.904424 0.443147 -1.477697
H  -2.501537 2.468005 -1.438218
H  5.217921 -1.180098 -0.357846
H  5.465754 0.047157 0.915221
H  5.065905 0.558084 -0.762519
H  -2.498903 4.286797 -0.078796
H  -2.320223 -3.663178 1.628286
