program: Gaussian 09
title: 000029737
version: EM64L-G09RevD.01
frameworkgroup: C1[X(C14H18O3)]
method: RPBEPBE
basis: SDD
operation: Freq
keyword: #pfreq=noraman
keyword: PBEPBE/SDD
title: #p freq=noraman PBEPBE/SDD
converged: YES YES NO NO
title: Mulliken charges:
elementType: O O O C C C C C C C C C C C C C C H H H H H H H H H H H H H H H H H H
charge: -0.283014 -0.285707 -0.267130 0.135189 0.031228 0.112747 -0.062450 0.490277 0.215400 0.203620 -0.582405 -0.528653 -0.790267 -0.783401 -0.688478 -0.513730 -0.512707 0.258372 0.206351 0.203072 0.212755 0.261103 0.220488 0.244110 0.232737 0.243737 0.246892 0.209383 0.218545 0.214840 0.215276 0.230665 0.232974 0.230269 0.227912
chargesum: 0.00000
title: Mulliken charges with hydrogens summed into heavy atoms:
elementType: O O O C C C C C C C C C C C C C C
charge: -0.283014 -0.285707 -0.267130 0.135189 0.031228 0.112747 -0.062450 0.490277 0.215400 0.203620 -0.324033 -0.119230 -0.095920 -0.062817 -0.013658 0.147050 0.178448
polarizability: 2.16768181e+02 -2.00198423e+00 1.87984535e+02 4.11564722e+00 -1.25012218e+00 9.80438961e+01
1716.lowfreq: -7.6536 -0.0006 -0.0005 -0.0002 5.3931 9.9189 22.0370 37.2830 68.1345
frequency: 21.8789 37.0742 68.1235 77.8452 93.7740 100.2425 113.6798 131.0410 147.6434 153.5800 169.5877 185.5571 199.1838 222.4702 233.0439 265.8223 277.0893 297.8587 315.7498 326.2498 341.0197 377.1811 426.5286 480.5794 510.7395 532.8137 562.9517 611.4896 628.8022 646.8808 671.5786 678.8764 764.6690 774.9306 787.7208 854.1686 863.4060 912.1437 926.5067 958.2762 992.4282 996.5058 1039.1421 1048.9310 1062.5647 1064.7772 1099.6749 1107.2611 1110.2136 1121.5588 1145.9547 1150.0878 1178.1018 1192.1113 1209.6730 1253.8958 1273.0759 1307.3441 1349.8707 1380.9094 1391.2291 1403.0831 1409.1738 1412.4460 1428.0237 1441.5091 1454.5270 1455.4899 1460.4352 1460.9623 1465.0218 1466.1528 1468.4058 1471.0852 1473.5772 1478.6509 1484.4253 1490.6387 1600.8725 1605.4273 1642.4104 2952.9042 2975.1021 2980.3489 2980.6153 2987.5393 2995.2548 3037.7270 3045.6657 3054.5526 3055.9726 3076.0818 3087.0143 3091.8950 3093.5569 3101.9637 3107.3329 3125.3660 3150.1997
redmass: 2.8234 2.5527 3.3428 2.5397 1.5863 1.1675 3.1953 1.2801 2.5685 1.5494 2.5976 1.2624 1.5301 2.9309 1.9866 2.8723 3.3074 2.4790 4.2051 4.2625 4.6912 4.6020 4.7542 5.6407 5.5375 4.7701 4.3105 4.3016 4.2564 3.9443 6.7962 5.3086 5.1546 4.7029 1.2574 4.8260 1.5491 4.2686 4.3542 1.9384 2.4843 5.2880 1.4078 1.5078 1.7868 1.7669 4.1483 1.2452 1.2579 2.2978 1.5983 1.6085 2.6516 5.1930 1.4899 1.2837 5.7423 1.4575 4.1760 1.2472 2.1808 3.0040 1.4346 2.2601 1.3410 1.2819 1.0581 1.0457 1.0535 1.0616 1.2136 1.1012 1.0956 1.0516 1.0753 1.6268 1.1716 1.1022 10.2626 7.8427 7.2055 1.0311 1.0406 1.0355 1.0374 1.0301 1.0596 1.1033 1.1012 1.0980 1.0928 1.0997 1.1043 1.0996 1.1013 1.0967 1.1009 1.1035 1.0911
irintensity: 6.0381 0.3427 3.0021 1.4328 2.2045 1.0513 1.0098 0.5505 1.7790 2.3597 1.4795 0.6448 1.7422 3.0997 4.2424 1.1011 2.2689 3.0080 1.4003 2.1710 1.7035 4.0998 4.8988 0.3469 2.2411 2.3321 1.2293 8.6605 1.6168 0.7821 1.5870 3.5955 0.7268 4.6152 5.5032 16.1153 24.3858 8.2381 47.0346 15.1342 12.9660 100.4197 6.1955 1.2533 7.3397 11.8986 50.9326 0.5727 0.4491 45.7183 2.0717 1.4911 83.0173 65.8930 12.0654 27.1207 30.4608 1.0446 70.1138 14.7280 4.6183 58.1260 15.7030 11.9126 1.2911 6.2829 7.9721 10.1536 12.1152 20.1897 84.5697 4.7149 12.4598 2.3400 21.6842 53.3643 8.2921 12.2767 3.1835 69.7097 19.1060 66.2534 40.5834 68.0898 18.2272 59.0328 39.5371 57.2767 8.5656 12.0844 27.7912 60.3793 38.7727 15.1110 30.2107 15.0409 33.0681 30.3971 4.2643
temp: 298.150 k
press: 1.00000 atm
elementType: 8 8 8 6 6 6 6 6 6 6 6 6 6 6 6 6 6 1 1 1 1 1 1 1 1 1 1 1 1 1 1 1 1 1 1
symmnumber: 1
zpe: 751825.9 jmol-1
zpe.correction: 0.286355 hartree
zpe.thermalcorrener: 0.305180 hartree
zpe.thermalcorrenthalpy: 0.306125 hartree
zpe.thermalcorrgfe: 0.238745 hartree
zpe.sumelectzpe: -768.645532 hartree
zpe.sumelectthermal: -768.626707 hartree
zpe.sumelectthermalent: -768.625763 hartree
zpe.sumelectthermalfe: -768.693142 hartree
dipole: 1.6392 -1.8912 -1.2843
dipole: 2.8130
quadrupole: -88.3053 -95.6198 -102.5161
quadrupole: 0.0024 4.3736 2.7578
quadrupole: 7.1751 -0.1394 -7.0357 0.0024 4.3736 2.7578
hfenergy: -768.9318872 hartree
pointgroup: C01 [X(C14H18O3)]
dipole: -0.843143 0.5333685 -0.4790214 debye
polarizability: 215.0858803|5.4830891|188.9596402|-9.8656931|-2.2362801|98.7510914 unknown
InChI: InChI=1S/C14H18O3/c1-6-10-7-11(15-4)14-12(13(10)16-5)8(2)9(3)17-14/h7H,6H2,1-5H3
charge 0 multiplicity 1
35 atoms
O  -2.104346 -0.888508 0.295471
O  1.6185 2.111873 0.029718
O  -0.142207 -3.313772 -0.033792
C  -0.25012 0.499318 0.12193
C  -0.698089 -0.853141 0.118401
C  -1.437117 1.333715 0.322029
C  1.135861 0.770631 -0.016432
C  2.050524 -0.306888 -0.129627
C  -2.51652 0.473248 0.4190
C  0.180402 -1.951165 -0.014245
C  1.555825 -1.638404 -0.131799
C  3.551434 -0.056352 -0.181652
C  -1.472509 2.836955 0.429141
C  -3.981691 0.669974 0.629809
C  4.147602 0.20454 1.22742
C  1.665858 2.771679 -1.288772
C  -1.558205 -3.712524 0.02308
H  2.252418 -2.478329 -0.223728
H  4.053161 -0.929145 -0.640327
H  3.774884 0.818232 -0.82012
H  -2.433262 3.191177 0.841452
H  -0.657424 3.197917 1.079149
H  -1.336417 3.321176 -0.55741
H  -4.332479 0.138852 1.534181
H  -4.210431 1.741598 0.748311
H  -4.567806 0.286982 -0.226569
H  3.686616 1.101798 1.675497
H  5.240096 0.365903 1.168792
H  3.960515 -0.652473 1.899418
H  0.653009 2.855596 -1.729364
H  2.317731 2.2145 -1.990288
H  2.080548 3.776289 -1.109773
H  -2.027712 -3.387054 0.967487
H  -1.539986 -4.811274 -0.035536
H  -2.124864 -3.293925 -0.827554
