program: Gaussian 09
title: 000029665
version: EM64L-G09RevD.01
frameworkgroup: C1[X(C8H10BrN5)]
method: RPBEPBE
basis: SDD
operation: Freq
keyword: #p
keyword: freq=noraman
keyword: PBEPBE/SDD
title: #p freq=noraman PBEPBE/SDD
converged: NO YES NO NO
title: Mulliken charges:
elementType: Br N N N N N C C C C C C C C H H H H H H H H H H
charge: -0.016266 -0.326651 -0.200344 -0.635793 -0.625460 -0.635999 0.302968 -0.390610 -0.386262 -0.168929 -0.162351 -0.233054 0.185112 0.246109 0.270327 0.249075 0.244559 0.245025 0.329241 0.339537 0.339753 0.309033 0.428856 0.292126
chargesum: 0.00000
title: Mulliken charges with hydrogens summed into heavy atoms:
elementType: Br N N N N N C C C C C C C C
charge: -0.016266 -0.326651 -0.200344 0.032985 0.023326 0.084983 0.302968 -0.120283 -0.137187 0.075630 0.082673 -0.233054 0.185112 0.246109
polarizability: 2.79269639e+02 -3.29667175e+00 1.23079833e+02 -3.34389637e+00 -7.46679445e+00 7.15690890e+01
1716.lowfreq: -7.2668 -3.9331 -0.0007 -0.0004 -0.0003 1.7046 37.1977 39.7246 66.2057
frequency: 37.1963 39.6870 66.2034 109.0580 123.8984 165.6251 187.3380 225.6698 263.9015 278.2425 320.1223 366.9046 387.1409 408.1728 428.0467 450.2841 465.9732 496.1076 524.3759 528.6251 536.9959 592.8778 621.7208 681.8968 695.0034 709.2742 712.8530 794.4042 821.3397 840.3404 877.2583 945.9076 952.4186 961.1292 985.1166 996.5763 1033.5321 1057.0814 1082.7801 1101.2484 1168.8924 1176.9131 1261.2066 1284.2093 1339.4338 1392.7302 1411.7163 1446.5270 1468.5982 1517.6257 1542.0112 1556.9513 1585.8445 1597.6510 1606.4252 1647.6016 2895.8627 3137.1152 3146.9476 3163.2907 3170.1185 3544.6004 3561.5898 3602.6405 3700.3511 3716.9425
redmass: 6.7717 4.5973 4.9533 5.2438 6.2407 7.0177 5.7117 5.0240 1.2126 5.1184 4.2067 5.1287 3.7573 2.6926 3.2150 1.2193 1.2257 2.4437 2.6152 1.2162 1.2017 5.8622 6.9669 7.5639 5.0069 6.6809 4.6482 3.4545 1.2421 1.9718 4.3077 1.2760 1.1227 1.3449 4.8075 2.5131 1.9136 2.3690 1.7372 1.3565 1.8498 1.1329 3.7847 1.2712 4.7716 3.9212 3.0531 2.1681 2.3674 3.1059 3.4952 7.0393 5.5872 1.3170 1.7126 2.1855 1.0762 1.0883 1.0881 1.0959 1.0972 1.0440 1.0451 1.0833 1.1053 1.1052
irintensity: 1.2610 0.6428 1.0285 0.9077 4.2113 9.5037 5.7475 2.9989 55.1916 3.3160 2.3629 8.8021 17.8266 6.7508 3.2911 3.9847 614.7028 23.7628 15.4983 15.7860 55.8414 6.8457 1.0280 16.8394 8.1534 22.8391 8.4563 12.9146 0.7506 57.9409 21.8340 20.3456 110.1782 0.9528 38.7957 11.0111 1.8607 35.3679 8.8345 10.9164 0.9931 16.7957 181.3308 0.5556 13.9346 41.7749 191.2506 168.1129 386.6956 2.4825 975.9498 32.8731 139.7473 216.2637 320.9886 1067.7344 730.2728 6.5083 6.1761 11.1521 4.3947 46.5395 97.0836 31.0623 47.2472 37.4678
temp: 298.150 k
press: 1.00000 atm
elementType: 35 7 7 7 7 7 6 6 6 6 6 6 6 6 1 1 1 1 1 1 1 1 1 1
symmnumber: 1
zpe: 475612.0 jmol-1
zpe.correction: 0.181151 hartree
zpe.thermalcorrener: 0.195028 hartree
zpe.thermalcorrenthalpy: 0.195973 hartree
zpe.thermalcorrgfe: 0.138987 hartree
zpe.sumelectzpe: -597.075552 hartree
zpe.sumelectthermal: -597.061675 hartree
zpe.sumelectthermalent: -597.060731 hartree
zpe.sumelectthermalfe: -597.117716 hartree
dipole: 5.9869 -0.5955 -0.1320
dipole: 6.0179
quadrupole: -68.0312 -77.2643 -94.0733
quadrupole: -9.6752 -4.4115 0.9528
quadrupole: 11.7584 2.5253 -14.2837 -9.6752 -4.4115 0.9528
hfenergy: -597.2567032 hartree
pointgroup: C01 [X(C8H10Br1N5)]
dipole: 2.36282 -0.148975 -0.0239706 debye
dipolederiv: -0.8770492 -0.0156416 -0.0665752 0.000037 -0.0864511 0.0070453 -0.0557152 0.0038769 -0.0606884 -2.5371295 -0.1961306 -0.1581418 -0.5929536 -0.5962261 -0.2213579 -0.0508313 -0.1815957 -0.4530895 -2.2613221 0.3575221 0.3624875 0.7405504 -0.7036129 -0.315498 0.6558469 -0.3049998 -0.6548809 -0.4720407 0.3035233 0.219016 -0.1163825 -0.9940365 -0.3328093 -0.0683448 -0.2638573 -0.8725993 -1.8505237 0.0115759 0.0394866 0.0395786 -0.4281285 0.2372725 0.085509 0.2424759 -0.546218 -0.7999604 -0.1091931 -0.0949268 0.1924354 -0.846867 -0.2070734 0.1198065 -0.2015818 -0.7693925 1.8981508 0.1418151 0.1558189 0.0792775 0.0514198 -0.0291213 -0.0025368 -0.0264349 0.0497902 -0.4368687 -0.0546731 -0.0360893 0.2493259 -0.0153254 -0.0359523 -0.0795139 -0.0668972 -0.1771464 -0.409491 -0.025661 -0.0190017 -0.2759144 0.0174697 -0.0551492 0.0056254 -0.0427867 -0.170531 -0.2168798 0.0054233 -0.0052444 0.0263789 0.0913433 -0.0288954 -0.0045733 -0.0314098 -0.0799512 -0.1902344 0.0277467 -0.0193388 -0.0319318 0.0830886 -0.0278625 -0.0500415 -0.0398607 -0.0916111 1.2452304 -0.0004643 0.1082038 0.0255135 -0.0979871 -0.0138329 0.0960562 -0.0023734 -0.1462329 2.6187489 -0.2623911 -0.2981308 0.7699783 1.0136901 0.7229723 0.191989 0.6543397 0.8025281 2.435417 -0.0199992 -0.1181704 -0.8069897 1.0260602 0.6337847 -0.814746 0.5831332 0.7585819 0.0102272 -0.0843436 0.0120167 -0.0702113 -0.0124373 0.034676 0.0249359 0.0266027 0.1443122 0.0215859 0.0900131 -0.0231554 0.0716208 -0.02103 0.0412162 -0.008647 0.0389664 0.1469341 0.0324407 0.0705005 -0.027944 0.0843615 -0.0174942 0.0426181 -0.0314644 0.0389945 0.1445656 0.036653 -0.0817625 0.0052022 -0.0882986 -0.020196 0.0251076 0.0158876 0.0251583 0.1543181 0.1908959 -0.0146955 -0.0024844 -0.0177446 0.3184802 -0.0563476 -0.0022075 -0.0798348 0.3007591 0.1558261 -0.0084466 0.0151908 0.0097874 0.2580866 -0.0395919 0.0945019 -0.0276191 0.3063056 0.2809042 0.0153725 0.0244478 0.0346574 0.2539486 -0.1087747 0.0522317 -0.1067613 0.3093874 0.2314752 -0.0083192 0.0093426 -0.0262926 0.2264979 -0.128924 0.001722 -0.1290191 0.287715 0.830477 -0.1983838 -0.1429433 -0.3279969 0.276596 -0.0181119 -0.2452003 0.0110762 0.3259596 0.0634674 0.0566127 0.0609337 0.0312133 0.2231111 -0.1253905 0.0697097 -0.1195923 0.2911842 unknown
polarizability: 279.2334824|0.6910214|120.3905659|5.5013188|13.6295957|74.2945127 unknown
InChI: InChI=1S/C8H10BrN5/c9-5-1-3-6(4-2-5)13-8(12)14-7(10)11/h1-4H,10-12H2
charge 0 multiplicity 1
24 atoms
Br -5.409047 -0.278097 -0.301341
N  0.797531 -0.350617 0.118658
N  2.972681 0.532858 0.666329
N  1.112953 1.542149 1.584401
N  4.998877 -0.287724 -0.106084
N  2.997231 -1.367631 -0.79937
C  -0.612001 -0.272123 0.07842
C  -1.330448 0.930679 -0.20725
C  -1.362155 -1.474825 0.230705
C  -2.737746 0.930822 -0.321816
C  -2.768255 -1.483777 0.122592
C  -3.444905 -0.276093 -0.148732
C  1.585936 0.540227 0.747771
C  3.618852 -0.380119 -0.084365
H  -0.780862 1.862039 -0.383326
H  -0.821481 -2.40387 0.438275
H  -3.270582 1.858188 -0.553334
H  -3.325418 -2.416863 0.249137
H  1.804405 2.111652 2.065666
H  0.126197 1.613407 1.81943
H  5.418505 0.460141 0.439868
H  5.582873 -0.912766 -0.653213
H  1.942995 -1.325592 -0.690164
H  3.503064 -2.056063 -1.352557
