program: Gaussian 09
title: 000029635
version: EM64L-G09RevD.01
frameworkgroup: C1[X(C10H14O4)]
method: RPBEPBE
basis: SDD
operation: Freq
keyword: #pfreq=noraman
keyword: PBEPBE/SDD
title: #p freq=noraman PBEPBE/SDD
converged: YES YES NO NO
title: Mulliken charges:
elementType: O O O O C C C C C C C C C C H H H H H H H H H H H H H H
charge: -0.301801 -0.275905 -0.253020 -0.246633 0.033856 -0.420589 -0.275308 -0.711438 0.264820 0.254592 -0.215528 -0.212235 -0.472253 -0.474120 0.235403 0.227885 0.212774 0.224752 0.253740 0.255305 0.222851 0.216133 0.252001 0.251493 0.229211 0.247733 0.228594 0.247690
chargesum: 0.00000
title: Mulliken charges with hydrogens summed into heavy atoms:
elementType: O O O O C C C C C C C C C C
charge: -0.301801 -0.275905 -0.253020 -0.246633 0.269258 0.020070 0.203183 -0.017149 0.264820 0.254592 0.036473 0.039258 0.004691 0.002163
polarizability: 1.68290379e+02 8.87771101e+00 1.24329459e+02 -9.10506451e+00 -2.61252109e+00 8.45536477e+01
1716.lowfreq: -8.0857 0.0007 0.0007 0.0008 3.3484 3.5855 22.7404 28.3673 36.7251
frequency: 22.3849 28.3183 36.6815 61.1264 84.2669 100.2767 112.7031 149.1815 153.2527 186.0938 203.3198 222.2238 238.2935 268.2468 286.9421 342.8268 409.6029 449.6667 473.2210 507.1556 507.2725 530.7037 645.6090 655.9538 757.1673 779.8639 780.2304 813.4214 835.4316 877.3261 929.8589 939.7275 969.9140 994.1607 995.5631 1004.3733 1004.8364 1050.4474 1060.9913 1061.9601 1099.2415 1119.9912 1131.8912 1137.4309 1152.7618 1203.2145 1272.7216 1278.1030 1287.8932 1290.0669 1331.5119 1343.3287 1379.7553 1388.1890 1409.6368 1410.4347 1453.4807 1466.4212 1480.7153 1481.5408 1621.0856 1624.9241 1640.8003 1641.4001 2992.0285 3004.9793 3009.3845 3015.4008 3062.4666 3086.7701 3092.3073 3103.8895 3104.5133 3106.2679 3157.4731 3157.6286 3220.0659 3220.5176
redmass: 5.5800 4.5023 5.2312 4.8792 3.9333 3.4138 2.3189 2.5086 3.1652 3.0019 2.4574 1.1695 4.4468 4.2400 3.9198 3.7744 3.9069 3.0466 2.7353 2.4224 1.8191 2.8723 3.9457 3.4703 1.8940 3.3886 3.4184 1.6889 4.4178 4.1798 1.7722 6.7610 1.4449 1.4025 1.4058 1.0774 1.0758 2.8265 1.5955 1.5957 2.3661 3.7180 2.4022 4.1188 1.6615 1.3457 1.1287 1.2997 1.4136 1.4314 1.2815 1.4019 1.5955 1.2337 1.2235 1.2299 1.0828 1.0593 1.0505 1.0754 11.3659 11.6193 4.5388 4.5367 1.0364 1.0617 1.0638 1.0793 1.1009 1.1017 1.1033 1.0598 1.0599 1.1007 1.0957 1.0957 1.1158 1.1158
irintensity: 1.5641 0.7029 0.2124 3.5686 0.0087 2.6056 3.0459 2.1156 2.0895 1.9200 5.6984 0.9265 2.7808 6.8756 6.2419 17.1669 5.7205 8.6404 1.4377 0.8784 0.0369 1.4126 2.1454 1.9913 0.7417 31.8556 19.5330 7.9399 9.9931 29.5719 10.4790 31.9246 7.1081 40.2625 35.8233 49.3182 47.4055 107.8718 49.1042 15.7684 64.6767 517.3228 84.7595 240.8841 8.2065 2.3890 0.0370 9.4846 21.2375 43.7841 9.2100 0.7464 34.2246 10.2028 92.6605 47.7354 2.5958 11.8196 11.7278 9.6972 129.7991 150.4050 28.9232 13.7343 15.0064 6.2627 20.9315 19.8388 1.8660 2.6446 62.7178 4.7468 4.1988 17.8114 3.7703 4.4203 8.3992 7.5955
temp: 298.150 k
press: 1.00000 atm
elementType: 8 8 8 8 6 6 6 6 6 6 6 6 6 6 1 1 1 1 1 1 1 1 1 1 1 1 1 1
symmnumber: 1
zpe: 583244.3 jmol-1
zpe.correction: 0.222146 hartree
zpe.thermalcorrener: 0.238168 hartree
zpe.thermalcorrenthalpy: 0.239112 hartree
zpe.thermalcorrgfe: 0.175965 hartree
zpe.sumelectzpe: -689.245036 hartree
zpe.sumelectthermal: -689.229014 hartree
zpe.sumelectthermalent: -689.228070 hartree
zpe.sumelectthermalfe: -689.291217 hartree
dipole: 0.6774 1.3344 -2.1116
dipole: 2.5882
quadrupole: -73.0245 -78.0915 -86.0017
quadrupole: 8.0970 2.4343 3.6930
quadrupole: 6.0147 0.9477 -6.9624 8.0970 2.4343 3.6930
hfenergy: -689.4671817 hartree
pointgroup: C01 [X(C10H14O4)]
dipole: 0.2773716 0.5171301 -0.8321671 debye
polarizability: 168.6701775|7.6013297|123.8597708|-9.5774935|-2.3927545|84.6435373 unknown
InChI: InChI=1S/C10H14O4/c1-4-9(11)13-7-6-8(3)14-10(12)5-2/h4-5,8H,1-2,6-7H2,3H3
charge 0 multiplicity 1
28 atoms
O  -1.933908 0.290632 -0.52824
O  2.315669 0.552374 -0.26668
O  -3.575191 0.117743 1.134578
O  2.907936 -1.496394 0.692242
C  -1.35307 1.497473 0.164031
C  0.117192 1.554325 -0.274365
C  0.910609 0.328161 0.179323
C  -2.15988 2.739675 -0.235552
C  -3.05873 -0.29853 0.067905
C  3.228457 -0.461307 0.058408
C  -3.509527 -1.458343 -0.745204
C  4.579615 -0.105781 -0.448934
C  -4.581176 -2.20434 -0.37159
C  5.642817 -0.926965 -0.249461
H  -1.446298 1.320474 1.25333
H  0.170833 1.644877 -1.374757
H  0.573398 2.465922 0.155533
H  0.90481 0.203683 1.278562
H  0.534162 -0.602753 -0.27821
H  -3.208806 2.642524 0.089521
H  -2.13428 2.885265 -1.329928
H  -1.733707 3.638834 0.24585
H  -2.93246 -1.672878 -1.650629
H  4.664539 0.844834 -0.985511
H  -4.917774 -3.060697 -0.965006
H  -5.134882 -1.960407 0.542708
H  6.641195 -0.67272 -0.620068
H  5.518258 -1.871285 0.293444
