program: Gaussian 09
title: 000029611
version: EM64L-G09RevD.01
frameworkgroup: C1[X(C15H18N4O)]
method: RPBEPBE
basis: SDD
operation: Freq
keyword: #p
keyword: freq=noraman
keyword: PBEPBE/SDD
title: #p freq=noraman PBEPBE/SDD
converged: YES YES NO NO
title: Mulliken charges:
elementType: O N N N N C C C C C C C C C C C C C C C H H H H H H H H H H H H H H H H H H
charge: -0.339899 -0.148471 0.048789 -0.086399 -0.121530 -0.095974 0.372015 0.378347 0.414051 -0.390624 -0.383104 0.161169 -0.328898 -0.315377 -0.793861 -0.768619 -0.368774 -0.315344 -0.644526 -0.645760 0.291461 0.287522 0.240109 0.238010 0.212151 0.244938 0.245231 0.206341 0.248367 0.248191 0.242547 0.266975 0.239973 0.220291 0.239923 0.240173 0.220427 0.240158
chargesum: 0.00000
title: Mulliken charges with hydrogens summed into heavy atoms:
elementType: O N N N N C C C C C C C C C C C C C C C
charge: -0.339899 -0.148471 0.048789 -0.086399 -0.121530 -0.095974 0.372015 0.378347 0.414051 -0.099163 -0.095582 0.161169 -0.088789 -0.077367 -0.091541 -0.065720 -0.126227 -0.048369 0.055661 0.054999
polarizability: 6.16690609e+02 1.86823833e+00 1.96668368e+02 -3.04840734e-02 -1.37725404e-01 9.38932727e+01
1716.lowfreq: -7.9649 -3.5790 -0.0002 0.0006 0.0007 1.6964 17.1315 29.3234 51.2726
frequency: 15.1781 29.3210 51.2683 60.8753 69.3872 118.5237 139.0360 145.0498 159.5580 179.2944 190.5354 194.0194 203.4791 216.7543 238.5308 266.0093 270.1426 319.6631 328.2428 355.4698 383.7074 416.4399 436.8649 437.6957 484.1169 492.0289 520.4536 523.3171 531.3105 558.8011 590.0286 602.5059 609.9690 634.0708 714.4775 731.1989 750.2400 804.6453 804.8270 831.5799 846.6480 859.0243 878.0795 939.2473 960.5316 978.5086 980.1632 981.7156 986.4789 1041.4142 1041.5697 1045.5783 1052.5956 1053.9884 1103.1794 1110.6057 1120.8158 1149.0858 1158.1966 1164.5560 1197.2253 1223.3013 1255.4039 1264.1272 1301.2850 1309.8086 1313.2663 1315.5764 1362.6607 1378.3813 1397.5130 1402.6168 1406.1457 1429.3516 1444.9153 1446.6735 1453.1233 1454.1757 1457.9416 1464.4124 1466.1467 1477.1633 1488.5991 1492.2840 1499.3680 1506.5455 1519.0955 1549.7834 1614.0113 1624.3941 2948.5926 2955.5932 2990.7967 2994.1396 3017.7433 3020.8628 3082.9334 3085.1659 3091.2200 3095.1124 3100.4782 3111.3721 3144.5629 3150.7471 3170.3681 3175.0519 3195.7536 3204.2084
redmass: 3.3488 5.3693 5.0364 4.1332 2.4215 2.4264 1.4809 1.1740 5.2945 2.6742 3.9256 1.6181 2.5934 1.5840 2.4021 2.0899 3.4468 2.9533 4.2120 4.8343 4.2967 4.3896 3.9249 5.4838 4.3550 3.7921 3.0433 5.3355 2.3495 4.5659 5.7886 3.3731 4.5981 6.6583 4.9625 3.9632 4.1904 1.5641 3.0659 1.7686 1.3187 1.4883 6.7804 3.0621 1.3596 2.5377 1.3333 2.4960 2.8107 1.5430 2.0909 1.5299 1.9357 1.5331 1.2372 1.3290 1.4183 2.5040 1.9937 1.8407 1.6914 2.3146 2.9967 2.8162 3.3571 1.6201 5.0660 4.3762 2.9965 4.5996 2.3478 1.3065 1.2712 1.1901 1.4181 1.0471 1.0468 1.5266 2.1230 1.0403 1.1869 1.0459 2.5295 1.1404 1.4026 3.8213 1.9106 6.3476 5.4835 6.2120 1.0365 1.0389 1.0364 1.0359 1.0997 1.1027 1.0970 1.0959 1.1009 1.1009 1.0970 1.0948 1.0884 1.0864 1.0951 1.0951 1.0931 1.0944
irintensity: 0.0891 0.0007 0.4265 4.3926 0.6517 1.3641 1.9236 1.5594 0.9487 1.7340 0.5419 0.5744 3.4825 1.2758 1.2953 4.0654 2.2590 2.1611 2.7334 0.0690 8.8192 0.8397 0.6906 15.1750 43.7025 10.2640 0.1123 1.8644 20.8147 8.9170 5.7448 3.0517 10.9676 3.5014 0.3004 2.0807 0.1919 5.4093 10.4702 72.4350 0.1796 55.9290 2.0938 43.5830 1.2136 5.2558 0.6733 6.1516 0.3230 8.6585 8.0568 9.5543 3.8719 24.3793 0.0080 1.0304 4.6582 32.0478 266.5174 150.1217 8.3449 0.1072 26.0934 33.7451 34.4056 10.2997 84.1186 187.4072 282.5588 1.2545 13.3272 19.8221 13.3551 6.1150 10.5137 13.4530 12.9239 32.9012 6.6820 0.0111 38.8082 23.9895 7.1210 1.4352 10.8937 31.8066 263.0824 52.0353 39.3228 680.2488 91.3303 220.8656 26.8613 22.7206 7.1838 69.4398 11.4678 8.7893 34.2569 27.4160 3.9508 49.3606 5.1285 5.5169 19.3240 26.7283 0.7619 0.4905
temp: 298.150 k
press: 1.00000 atm
elementType: 8 7 7 7 7 6 6 6 6 6 6 6 6 6 6 6 6 6 6 6 1 1 1 1 1 1 1 1 1 1 1 1 1 1 1 1 1 1
symmnumber: 1
zpe: 800963.2 jmol-1
zpe.correction: 0.305071 hartree
zpe.thermalcorrener: 0.324699 hartree
zpe.thermalcorrenthalpy: 0.325643 hartree
zpe.thermalcorrgfe: 0.255722 hartree
zpe.sumelectzpe: -875.078789 hartree
zpe.sumelectthermal: -875.059161 hartree
zpe.sumelectthermalent: -875.058217 hartree
zpe.sumelectthermalfe: -875.128138 hartree
dipole: -10.1983 0.6913 -0.0031
dipole: 10.2217
quadrupole: -116.8252 -102.9524 -122.7170
quadrupole: -0.5869 -0.0340 -0.0416
quadrupole: -2.6603 11.2125 -8.5521 -0.5869 -0.0340 -0.0416
hfenergy: -875.3838602 hartree
pointgroup: C01 [X(C15H18N4O1)]
dipole: -4.0095629 0.1277969 0.2826155 debye
polarizability: 616.6831371|-2.3259487|108.0400547|-1.3288737|35.4031617|182.5290584 unknown
InChI: InChI=1S/C15H18N4O/c1-11-9-19(20)10-12(2)15(11)17-16-13-5-7-14(8-6-13)18(3)4/h5-10H,1-4H3
charge 0 multiplicity 1
38 atoms
O  6.459676 -0.072569 -0.064635
N  -5.516893 0.095596 0.24574
N  5.126102 -0.044428 -0.005835
N  0.892649 0.108703 0.340099
N  0.083031 -0.280294 -0.632956
C  2.279771 0.010873 0.108362
C  3.08415 0.446467 1.224201
C  2.961271 -0.457077 -1.077877
C  -4.138866 0.01348 0.054218
C  4.476155 0.40759 1.139321
C  4.361331 -0.466186 -1.089048
C  -1.295168 -0.151714 -0.329547
C  -3.586258 -0.488032 -1.17131
C  -3.221343 0.430113 1.081344
C  2.444647 0.951065 2.500985
C  2.263241 -0.945245 -2.329894
C  -2.199084 -0.56442 -1.349205
C  -1.839073 0.348553 0.892985
C  -6.436355 -0.338169 -0.816313
C  -6.061499 0.610317 1.511216
H  5.146119 0.719616 1.940901
H  4.952129 -0.802683 -1.942327
H  -4.242829 -0.817105 -1.980762
H  -3.602918 0.819309 2.029519
H  3.21201 1.232605 3.242584
H  1.80491 1.827369 2.29801
H  1.787433 0.180918 2.940304
H  3.003875 -1.24131 -3.094174
H  1.60337 -1.800824 -2.107785
H  1.600563 -0.166359 -2.743465
H  -1.777307 -0.947509 -2.284825
H  -1.146262 0.666608 1.678206
H  -6.291454 0.246337 -1.746766
H  -7.475627 -0.193084 -0.483465
H  -6.302348 -1.411015 -1.06067
H  -5.745258 -0.007447 2.375327
H  -7.161469 0.59493 1.468635
H  -5.74222 1.654621 1.700202
