program: Gaussian 09
title: 000029570
version: EM64L-G09RevD.01
frameworkgroup: C1[X(C4H8Br2O)]
method: RPBEPBE
basis: SDD
operation: Freq
keyword: #p
keyword: freq=noraman
keyword: PBEPBE/SDD
title: #p freq=noraman PBEPBE/SDD
converged: YES YES NO NO
title: Mulliken charges:
elementType: Br Br O C C C C H H H H H H H H
charge: 0.005389 -0.032483 -0.417598 -0.015340 -0.341322 -0.722664 -0.667248 0.249794 0.230017 0.229702 0.270632 0.286922 0.278578 0.306124 0.339497
chargesum: 0.00000
title: Mulliken charges with hydrogens summed into heavy atoms:
elementType: Br Br O C C C C
charge: 0.005389 -0.032483 -0.078101 0.234454 0.118396 -0.165110 -0.082546
polarizability: 1.26785369e+02 1.02237624e+01 5.43373969e+01 -8.01965450e+00 -2.97178364e+00 5.09785960e+01
1716.lowfreq: -8.3246 -0.0005 -0.0004 -0.0001 5.1956 6.2371 42.7862 69.2668 102.8833
frequency: 42.7741 69.2272 102.8786 112.6754 137.7352 228.2264 274.2979 301.5697 449.7536 459.2981 625.7537 642.4497 765.0171 811.8384 882.0526 970.8774 1010.5899 1047.8716 1071.0263 1104.6280 1125.8110 1211.9512 1239.0373 1258.3830 1299.9055 1312.2389 1333.8761 1382.0518 1436.3010 1453.4123 1461.6792 2994.0790 3033.9643 3048.7200 3060.0535 3066.4461 3122.7951 3153.5889 3547.4144
redmass: 5.4415 4.4257 4.0537 2.2266 29.7767 6.0936 1.0838 3.9908 2.1842 4.5308 4.3186 5.3560 1.2348 2.3866 1.6805 1.5574 2.5766 4.7115 2.1477 1.0516 1.4577 1.1671 1.1893 1.2826 1.2195 1.3286 1.3480 1.1736 1.1021 1.0906 1.0931 1.0598 1.0612 1.0905 1.0762 1.0754 1.1080 1.1100 1.0661
irintensity: 4.1726 1.8780 3.8799 1.6255 0.2122 6.5217 150.9581 0.1251 4.9891 62.9660 26.6211 2.0956 3.8814 8.4958 32.6501 35.3973 7.3207 36.1228 8.8462 32.1558 12.8907 14.3251 1.4535 5.8743 59.3825 9.4888 14.7283 19.8362 5.9044 0.8205 14.9508 12.0749 11.3995 7.1202 8.6674 29.8907 11.3242 7.0525 6.4386
temp: 298.150 k
press: 1.00000 atm
elementType: 35 35 8 6 6 6 6 1 1 1 1 1 1 1 1
symmnumber: 1
zpe: 302967.7 jmol-1
zpe.correction: 0.115394 hartree
zpe.thermalcorrener: 0.124676 hartree
zpe.thermalcorrenthalpy: 0.125620 hartree
zpe.thermalcorrgfe: 0.077723 hartree
zpe.sumelectzpe: -258.777482 hartree
zpe.sumelectthermal: -258.768200 hartree
zpe.sumelectthermalent: -258.767256 hartree
zpe.sumelectthermalfe: -258.815153 hartree
dipole: 0.2002 -1.4407 1.0234
dipole: 1.7785
quadrupole: -80.6558 -63.8047 -57.4896
quadrupole: -2.2553 2.1775 1.5345
quadrupole: -13.3391 3.5119 9.8271 -2.2553 2.1775 1.5345
hfenergy: -258.8928761 hartree
pointgroup: C01 [X(C4H8Br2O1)]
dipole: 0.0988544 -0.601124 0.3442093 debye
dipolederiv: -0.6198434 -0.0244172 0.0281283 -0.0945346 -0.1218442 0.0159775 0.0731275 0.0183555 -0.1317163 -0.6489203 -0.0242501 0.0287237 -0.1066217 -0.1696533 0.0202641 0.100313 0.0175128 -0.1603056 -0.694436 -0.0461024 -0.0013354 -0.0158809 -0.6497131 -0.2365952 0.0344341 -0.2633029 -0.2197052 0.2367678 0.0676139 0.0318897 -0.0157467 0.5400029 0.21668 0.0045058 0.2085414 0.3222117 -0.3740395 -0.0323539 -0.0078234 0.0629607 -0.0274192 0.0139959 0.0200209 0.0608531 0.0944068 0.7643811 0.1733388 -0.1308709 0.1484276 -0.0020601 -0.0721506 -0.1408716 -0.0256161 0.125299 0.8341288 0.1525578 -0.1068487 0.0643502 0.1249249 -0.0472254 -0.1119129 -0.0377314 0.1538284 0.0945593 -0.0139538 -0.0061208 0.0029631 0.0186342 0.0292922 -0.0035231 -0.0059741 -0.1005606 0.0752284 -0.0107229 -0.0236779 0.0183476 0.075665 0.0193824 -0.0117953 0.0363731 -0.1280103 0.0954947 -0.0161157 -0.0056869 0.0242541 -0.1046573 -0.0724322 -0.0134995 -0.0852118 0.0493838 -0.067285 -0.0376018 0.0950388 -0.0265555 0.0787591 0.0164579 0.0238983 0.051366 -0.0977269 -0.0368794 -0.0819822 0.006992 -0.0434149 -0.0614158 -0.0555378 0.0177081 -0.0610434 0.0704222 -0.0506523 -0.0374414 0.0739693 -0.0239749 0.0792353 0.0234748 0.0111841 0.0383525 -0.0948555 -0.0008471 -0.0758681 0.0262625 0.0047157 -0.0354016 -0.02378 0.0460057 -0.031585 0.0754855 0.3923429 0.0072991 -0.0086403 0.0007101 0.2549432 0.1521964 -0.049595 0.0791104 0.041843 unknown
polarizability: 125.8660049|11.5317898|55.0882009|-10.061471|-3.1479922|51.1471562 unknown
InChI: InChI=1S/C4H8Br2O/c5-2-1-4(7)3-6/h4,7H,1-3H2
charge 0 multiplicity 1
15 atoms
Br 3.517925 -0.200374 -0.252438
Br -3.763644 -0.32247 0.158135
O  0.697619 1.433068 0.425695
C  0.565646 0.107868 -0.192379
C  -0.826961 -0.515835 0.12599
C  1.670462 -0.871649 0.224632
C  -1.944479 0.39015 -0.397999
H  0.645457 0.318944 -1.273272
H  -0.931775 -0.647943 1.220519
H  -0.90893 -1.517225 -0.336978
H  1.693682 -1.037378 1.31557
H  1.572034 -1.835129 -0.299271
H  -1.981862 0.426701 -1.497535
H  -1.883524 1.404898 0.019464
H  0.838351 1.332074 1.402367
