program: Gaussian 09
title: 000029542
version: EM64L-G09RevD.01
frameworkgroup: C1[X(C10H11N5)]
method: RPBEPBE
basis: SDD
operation: Freq
keyword: #pfreq=noraman
keyword: PBEPBE/SDD
title: #p freq=noraman PBEPBE/SDD
converged: YES YES NO NO
title: Mulliken charges:
elementType: N N N N N C C C C C C C C C C H H H H H H H H H H H
charge: -0.127982 -0.128012 -0.118316 -0.583095 -0.583096 0.298118 0.447899 -0.352378 -0.352362 0.034308 -0.389699 -0.389650 -0.810211 0.019426 0.019436 0.272068 0.272092 0.228410 0.228367 0.225609 0.225617 0.236719 0.331240 0.332126 0.332126 0.331238
chargesum: 0.00000
title: Mulliken charges with hydrogens summed into heavy atoms:
elementType: N N N N N C C C C C C C C C C
charge: -0.127982 -0.128012 -0.118316 0.080272 0.080268 0.298118 0.447899 -0.080310 -0.080270 0.034308 -0.161288 -0.161283 -0.122266 0.019426 0.019436
polarizability: 2.42833043e+02 -3.07371753e-03 1.62580585e+02 -6.25482713e-01 -7.63249795e-02 6.26593696e+01
1716.lowfreq: -7.4230 -5.0559 -0.0009 -0.0008 -0.0005 7.9456 13.7542 46.3452 63.3935
frequency: 13.1260 46.3026 63.3935 106.9043 159.3793 182.9610 187.5423 259.4824 289.7481 310.1647 334.1692 375.6327 408.6298 474.0428 477.4123 495.1301 517.9740 548.3865 548.6005 565.3982 566.1437 614.9023 637.5533 682.3206 715.1113 740.8202 784.4052 805.6991 853.0671 861.8322 868.5044 908.3722 980.8560 987.6097 989.1901 994.3935 998.1446 1014.8679 1046.3495 1114.7558 1127.7172 1163.4339 1189.2956 1221.5450 1250.1201 1301.7834 1365.1834 1379.0415 1395.4491 1402.7561 1416.7052 1471.0771 1472.1916 1476.3519 1501.8623 1515.5975 1520.2369 1581.3960 1595.8993 1618.9229 1628.7578 2973.2468 3054.4631 3084.4848 3121.3961 3124.1335 3164.1900 3168.0008 3555.4532 3557.1015 3716.7781 3717.0286
redmass: 1.0163 3.9085 4.6882 4.4668 5.2236 7.9989 5.3335 4.5999 3.3182 4.5999 3.3380 2.8583 2.8904 1.1979 1.6145 1.8334 3.5537 1.0596 1.0277 7.3399 6.6069 5.6479 6.9692 4.7939 11.6531 3.2361 4.8893 5.3854 1.7612 1.2481 5.0847 9.6767 1.7087 2.2566 1.3767 2.4977 1.3679 2.4982 1.5800 1.2883 2.4357 2.0058 1.4786 2.8893 6.0356 1.3121 4.3750 5.0438 1.2257 5.5899 3.5744 1.1183 1.0781 4.6709 2.6528 4.4180 2.4740 6.2250 1.4611 3.3180 2.8732 1.0388 1.0944 1.0999 1.0896 1.0898 1.0935 1.0951 1.0439 1.0444 1.1058 1.1058
irintensity: 0.5618 0.0060 3.0440 1.3925 0.0286 0.0000 12.6745 0.9479 0.5621 7.7525 8.8623 2.0851 0.0284 0.0002 218.7345 396.8149 0.8256 7.9501 0.0091 3.1315 11.5893 0.1207 1.0485 0.0155 0.0001 1.8365 1.7702 73.3015 21.0692 0.0043 8.9075 7.1170 0.1874 0.8603 5.0553 0.6538 0.0022 9.5839 25.0432 14.4530 0.3283 13.7652 33.6392 0.7591 9.7428 0.5174 0.1648 276.6055 8.0874 8.1317 4.7719 1.3392 28.7566 602.1185 242.3596 551.1437 12.4587 0.4534 653.2938 243.8629 88.2354 37.4429 24.1691 17.5113 22.5082 22.1393 8.4344 3.7630 140.2456 74.2360 21.8557 69.3737
temp: 298.150 k
press: 1.00000 atm
elementType: 7 7 7 7 7 6 6 6 6 6 6 6 6 6 6 1 1 1 1 1 1 1 1 1 1 1
symmnumber: 1
zpe: 534496.8 jmol-1
zpe.correction: 0.203579 hartree
zpe.thermalcorrener: 0.216964 hartree
zpe.thermalcorrenthalpy: 0.217908 hartree
zpe.thermalcorrgfe: 0.161930 hartree
zpe.sumelectzpe: -660.403555 hartree
zpe.sumelectthermal: -660.390170 hartree
zpe.sumelectthermalent: -660.389226 hartree
zpe.sumelectthermalfe: -660.445204 hartree
dipole: 1.0440 0.0010 0.0717
dipole: 1.0465
quadrupole: -64.6570 -68.6461 -92.9772
quadrupole: -0.0028 -0.3110 -0.0016
quadrupole: 10.7698 6.7807 -17.5505 -0.0028 -0.3110 -0.0016
hfenergy: -660.6071337 hartree
pointgroup: C01 [X(C10H11N5)]
dipole: -0.4107048 0.0015167 0.0287102 debye
dipolederiv: -1.6576764 0.548585 -0.0349415 0.4153168 -0.8420933 0.0437236 -0.0240038 0.0420299 -0.2013291 -1.6575171 -0.5483632 0.0397166 -0.4148733 -0.8420765 0.0440564 0.0335547 0.04521 -0.2015668 -0.7668955 0.000149 0.0007717 0.0002688 -1.4129649 0.0790422 0.0019517 0.0790826 -0.2628063 -0.6742628 0.600034 -0.0417247 0.7450734 -1.1826411 0.0303165 -0.0509681 0.0298355 -0.719494 -0.6738682 -0.5999423 0.0398907 -0.7449538 -1.182496 0.0334581 0.0506371 0.0339887 -0.7199955 -0.7045305 -0.0002884 -0.004221 -0.0000484 -0.0560247 0.0007716 0.0002031 0.0008151 -0.0425854 0.5262649 0.0013185 0.0228227 0.006768 0.0309433 -0.0029664 0.1121489 -0.0028504 -0.0181476 0.1501959 -0.0576167 0.0049609 0.1666214 0.0096606 -0.0120262 -0.0208407 -0.0100423 -0.1130944 0.1501079 0.0578271 -0.001923 -0.1677465 0.0104582 -0.0030723 0.0015827 -0.0058938 -0.1138878 2.0668804 -0.0001012 -0.001746 -0.0002854 0.9737208 -0.060796 -0.0050185 -0.059702 0.0894754 -0.3305492 0.1210558 -0.0080432 0.3143637 0.0667557 -0.007942 -0.0263133 -0.0103037 -0.1805721 -0.3305191 -0.1211301 0.0065862 -0.3153038 0.065293 -0.0220812 0.011585 -0.0198169 -0.1791102 -0.2151773 -0.0007919 -0.0164826 -0.010747 0.0847762 -0.0013947 -0.1761477 -0.0014432 0.0626204 1.562938 -0.5979509 0.0384499 -0.6491396 1.7401121 -0.1026439 0.0412188 -0.1023763 0.2263042 1.5626606 0.5974501 -0.0432593 0.6484735 1.7400406 -0.1053367 -0.0501981 -0.105869 0.2267372 0.1310339 0.0778622 -0.0043967 0.0692244 0.0033422 0.0094913 -0.0005272 0.0103578 0.1467128 0.1311095 -0.0778042 0.0049715 -0.0687856 0.0031123 0.0080524 0.0075567 0.0078559 0.146955 -0.0110952 -0.1019554 0.0094931 -0.1171035 -0.0649318 0.0118479 0.01416 0.0167272 0.1474793 -0.0111524 0.102392 -0.0028814 0.1179848 -0.0652476 0.0141039 -0.0002758 0.0092548 0.1477564 0.0071992 0.0272981 0.0216132 0.1158442 -0.0764601 -0.0919629 0.0862979 -0.0706869 0.0719106 0.0068008 -0.0246897 0.0249413 -0.1045029 -0.0543972 0.1074351 0.0999646 0.0861856 0.0500691 -0.0559779 -0.0034993 -0.0573031 -0.0065757 0.1106778 -0.0128669 -0.108867 -0.0128553 -0.0997225 0.2331365 -0.0687054 0.0052246 -0.0470561 0.2012209 0.0127359 0.0036343 0.0127935 0.385443 0.1639105 -0.0202612 0.0020051 -0.067363 0.2690172 0.0078701 0.0052043 0.0078761 0.3826616 0.1638867 0.0203401 -0.0004937 0.067429 0.2690009 0.007684 -0.0037756 0.0075909 0.382685 0.2330967 0.0687882 -0.0040312 0.0471168 0.2012015 0.0125002 -0.0027636 0.0122361 0.3855016 unknown
polarizability: 242.8344103|0.022596|162.156824|0.3800644|-6.4938088|63.0817638 unknown
InChI: InChI=1S/C10H11N5/c1-6-2-4-7(5-3-6)8-13-9(11)15-10(12)14-8/h2-5H,11-12H2,1H3
charge 0 multiplicity 1
26 atoms
N  -1.31183 1.210965 -0.082086
N  -1.311542 -1.210904 0.080646
N  -3.435649 0.000212 0.006333
N  -3.364544 2.335419 -0.152901
N  -3.363882 -2.335043 0.164975
C  0.811751 -0.000191 -0.006921
C  3.671475 -0.000757 -0.015866
C  1.5325 1.22012 -0.085442
C  1.532465 -1.221019 0.063754
C  -0.672435 -0.000027 -0.002711
C  2.940953 1.215329 -0.090925
C  2.940877 -1.21697 0.057096
C  5.189376 0.000381 0.011739
C  -2.686483 1.146079 -0.073817
C  -2.686189 -1.145794 0.081512
H  0.965834 2.154129 -0.145164
H  0.965782 -2.155247 0.119644
H  3.486016 2.165124 -0.155426
H  3.485917 -2.167631 0.108183
H  5.604029 -0.922825 -0.430066
H  5.605271 0.862331 -0.539219
H  5.565485 0.063751 1.051847
H  -4.381046 2.330023 -0.149581
H  -2.834203 3.200411 -0.213581
H  -2.833247 -3.200107 0.221963
H  -4.380383 -2.329559 0.168116
