program: Gaussian 09
title: 000002960
version: EM64L-G09RevD.01
frameworkgroup: C1[X(C11H11N5O2)]
method: RPBEPBE
basis: SDD
operation: Freq
keyword: #p
keyword: freq=noraman
keyword: PBEPBE/SDD
title: #p freq=noraman PBEPBE/SDD
converged: YES YES NO NO
title: Mulliken charges:
elementType: O O N N N N N C C C C C C C C C C C H H H H H H H H H H H
charge: -0.321216 -0.245844 -0.322854 -0.376575 -0.501812 -0.079210 -0.596423 0.335383 -0.531060 0.205778 -0.425444 0.027713 0.135669 0.086483 -0.368304 -0.274035 -0.022039 0.136983 0.182796 0.248289 0.243815 0.213383 0.323376 0.339569 0.345823 0.260441 0.305518 0.355636 0.318160
chargesum: 0.00000
title: Mulliken charges with hydrogens summed into heavy atoms:
elementType: O O N N N N N C C C C C C C C C C C
charge: -0.321216 -0.245844 0.000522 -0.030752 -0.196294 -0.079210 0.077373 0.335383 -0.099975 0.205778 0.031754 0.027713 0.135669 0.086483 -0.028734 -0.013594 -0.022039 0.136983
polarizability: 2.91310220e+02 1.19721589e+01 1.83783672e+02 -2.84573887e+00 3.38222707e+00 7.64194551e+01
1716.lowfreq: -6.0535 -3.0788 -0.0009 -0.0007 0.0001 2.8188 14.1340 48.6085 105.1812
frequency: 13.3658 48.5908 105.1776 119.4531 155.6729 176.9746 185.4421 193.8703 237.1693 240.6329 277.6046 284.3584 306.3472 356.8334 382.2179 412.9668 438.9174 456.3436 507.6667 521.3802 535.1585 555.7510 598.4322 613.5823 617.7442 631.1570 646.6168 674.5779 692.0475 716.3728 731.6920 750.2157 763.2365 794.4693 803.8331 885.3317 911.2479 950.2426 952.9997 973.9703 1003.0006 1037.5411 1039.8797 1090.7765 1097.2189 1119.4070 1130.7200 1172.7539 1175.0361 1223.5874 1234.9353 1272.0881 1305.5464 1337.6467 1345.4847 1353.6560 1377.0668 1396.8924 1422.9733 1441.8589 1445.7743 1450.7691 1463.0840 1478.4681 1528.9049 1561.2496 1574.0519 1586.6763 1616.4264 1666.1181 2973.3754 2981.1094 3044.5474 3062.4495 3197.7453 3240.1273 3538.0278 3548.0561 3556.0165 3592.4393 3703.9840
redmass: 4.8422 6.5607 5.2424 3.1182 5.0943 5.5512 6.3490 4.4983 4.5842 6.3910 2.5603 1.2107 5.7820 4.1776 4.3717 4.9986 2.3157 1.8573 3.1909 1.2304 1.3161 5.0573 3.6455 4.4847 4.3119 8.4867 4.6489 4.5756 8.2897 6.3664 1.7580 3.2815 3.9805 1.5001 4.5855 3.6506 3.2149 1.2794 2.7074 3.4341 2.1225 3.4562 2.8155 1.6713 1.5648 2.8320 4.3792 2.6126 4.8305 1.2829 2.0586 1.3881 1.5468 1.5394 2.7217 2.0941 1.4413 1.9499 3.1073 1.1791 2.8781 4.8754 4.1510 1.3449 4.2531 6.0061 2.5514 4.4891 2.1430 4.5289 1.0659 1.0623 1.0989 1.0962 1.0986 1.1024 1.0808 1.0769 1.0455 1.0795 1.1049
irintensity: 4.2974 10.8569 1.3895 2.3445 7.8201 2.0764 8.0799 2.2580 4.4775 0.6726 7.1160 20.8283 19.1196 7.8650 15.6545 2.7114 111.5976 127.2155 16.1369 136.7727 68.9914 11.7078 5.8262 13.5865 9.1003 24.2554 10.0443 2.1721 11.7700 24.7336 105.6873 11.9324 36.0280 30.8463 7.5666 9.3700 3.6767 22.1936 13.4944 28.9315 19.7546 77.9666 26.3085 41.4346 86.1157 18.2963 107.8687 35.0980 230.4768 0.7132 2.8045 13.1586 17.7447 50.2348 44.9701 20.1884 23.1730 91.0205 74.3897 20.4773 82.0867 306.1999 60.1386 116.5626 46.4052 320.9703 195.9813 251.9450 361.9234 321.5388 18.4421 33.7693 20.6734 39.6144 44.7909 10.4911 172.0850 50.0917 171.0759 12.8653 48.6123
temp: 298.150 k
press: 1.00000 atm
elementType: 8 8 7 7 7 7 7 6 6 6 6 6 6 6 6 6 6 6 1 1 1 1 1 1 1 1 1 1 1
symmnumber: 1
zpe: 577839.0 jmol-1
zpe.correction: 0.220087 hartree
zpe.thermalcorrener: 0.235264 hartree
zpe.thermalcorrenthalpy: 0.236208 hartree
zpe.thermalcorrgfe: 0.176967 hartree
zpe.sumelectzpe: -848.715546 hartree
zpe.sumelectthermal: -848.700369 hartree
zpe.sumelectthermalent: -848.699425 hartree
zpe.sumelectthermalfe: -848.758667 hartree
dipole: -2.4750 -8.3014 -0.5469
dipole: 8.6798
quadrupole: -102.4306 -89.7336 -107.3385
quadrupole: 29.9910 9.8420 -2.4902
quadrupole: -2.5964 10.1007 -7.5043 29.9910 9.8420 -2.4902
hfenergy: -848.9356332 hartree
pointgroup: C01 [X(C11H11N5O2)]
dipole: 0.95736 3.267869 -0.2568949 debye
polarizability: 291.0537109|12.7368993|183.7916902|5.4798935|-4.9808817|76.667946 unknown
InChI: InChI=1S/C11H11N5O2/c12-11-15-8(10(18)16-11)6-2-4-14-9(17)7-5(6)1-3-13-7/h1,3,13-15H,2,4,12H2
charge 0 multiplicity 1
29 atoms
O  -4.424213 0.660885 -0.607151
O  2.057432 -2.321042 0.416613
N  -2.704406 2.069797 0.063274
N  -2.943463 -1.563633 -0.236255
N  2.552389 1.126807 -0.2755
N  3.80632 -0.757396 0.103722
N  4.963112 1.280448 -0.365709
C  0.202206 0.377497 -0.089844
C  -0.201637 1.854291 -0.223972
C  -0.878799 -0.611511 -0.05646
C  -1.388807 2.30658 0.666707
C  -2.287843 -0.338247 -0.179734
C  1.568296 0.103037 -0.079371
C  -3.197835 0.823208 -0.267583
C  -0.75923 -2.055641 -0.019902
C  -2.037846 -2.604241 -0.135373
C  2.437558 -1.142728 0.164719
C  3.818869 0.551823 -0.177173
H  0.647458 2.49823 0.066828
H  -0.454024 2.09457 -1.277095
H  -1.313044 1.813901 1.657096
H  -1.305777 3.395207 0.832441
H  -3.382418 2.832476 0.009275
H  0.179322 -2.593848 0.094452
H  -3.958304 -1.595143 -0.366159
H  -2.353095 -3.644976 -0.145906
H  2.361293 2.049905 -0.657072
H  5.845658 0.779601 -0.292823
H  4.965227 2.288945 -0.489546
