program: Gaussian 09
title: 000029483
version: EM64L-G09RevD.01
frameworkgroup: C1[X(C3H2N4O4)]
method: RPBEPBE
basis: SDD
operation: Freq
keyword: #pfreq=noraman
keyword: PBEPBE/SDD
title: #p freq=noraman PBEPBE/SDD
converged: YES YES NO NO
title: Mulliken charges:
elementType: O O O O N N N N C C C H H
charge: -0.120582 -0.225647 -0.165513 -0.152812 -0.365291 -0.009901 0.045090 0.059686 0.292364 0.128433 -0.148218 0.373872 0.288520
chargesum: 0.00000
title: Mulliken charges with hydrogens summed into heavy atoms:
elementType: O O O O N N N N C C C
charge: -0.120582 -0.225647 -0.165513 -0.152812 0.008581 -0.009901 0.045090 0.059686 0.292364 0.128433 0.140302
polarizability: 1.05657204e+02 4.14864748e+00 9.94610974e+01 -7.12595856e-02 -2.00744151e-02 2.92703578e+01
1716.lowfreq: -65.7495 -6.3880 -0.0010 -0.0009 -0.0008 5.5397 6.5276 48.1482 175.9789
frequency: -65.7483 48.1470 175.9785 179.5207 233.5063 234.1316 370.9151 390.1493 490.9750 582.6068 586.0498 623.1789 693.9739 728.8837 733.8460 764.8333 794.4417 838.5345 906.2476 1026.1111 1113.9540 1148.5045 1179.5414 1221.0679 1255.7312 1310.3822 1370.0356 1374.1853 1398.4135 1438.7538 1473.7774 3257.9916 3515.3360
redmass: 15.6946 14.5699 8.4419 14.9812 8.4950 7.4763 10.5985 12.2472 11.4274 7.9057 8.5928 4.5561 9.6350 14.2661 9.5061 14.0492 1.1862 1.4374 8.2671 3.1461 2.0999 4.7201 5.3873 3.4025 6.7585 6.3988 4.1525 9.4887 13.0716 4.1475 5.3126 1.1007 1.0824
irintensity: 0.0002 0.9284 7.8242 0.6312 3.2239 1.6582 0.3868 4.6304 1.8350 0.1812 6.8535 23.0570 2.8371 53.2130 3.1090 27.2352 132.8608 0.8021 0.1956 25.7990 31.5148 92.7867 53.0048 237.4005 16.8921 69.5732 22.3173 113.3193 185.1960 21.9207 3.1787 2.5280 122.4337
temp: 298.150 k
press: 1.00000 atm
elementType: 8 8 8 8 7 7 7 7 6 6 6 1 1
symmnumber: 1
zpe: 188170.8 jmol-1
zpe.correction: 0.071670 hartree
zpe.thermalcorrener: 0.079705 hartree
zpe.thermalcorrenthalpy: 0.080650 hartree
zpe.thermalcorrgfe: 0.037616 hartree
zpe.sumelectzpe: -634.412137 hartree
zpe.sumelectthermal: -634.404102 hartree
zpe.sumelectthermalent: -634.403158 hartree
zpe.sumelectthermalfe: -634.446192 hartree
dipole: -3.5238 5.8611 0.0006
dipole: 6.8389
quadrupole: -76.7896 -58.7222 -59.0224
quadrupole: -8.2944 0.0135 0.0131
quadrupole: -11.9448 6.1225 5.8223 -8.2944 0.0135 0.0131
hfenergy: -634.4838076 hartree
pointgroup: C01 [X(C3H2N4O4)]
dipole: -1.1532595 -2.4309268 -0.0002336 debye
dipolederiv: -0.4195315 0.0640529 -0.0004126 0.0153047 -0.6941315 -0.0018213 -0.000685 -0.0022181 -0.1597006 -0.8703996 -0.0579922 -0.0012095 -0.1399708 -0.4814157 -0.0012628 -0.0008259 -0.0008088 -0.2508187 -0.5128623 -0.0377762 -0.0015459 0.0725977 -0.608539 0.0029072 -0.0025595 0.0020193 -0.1946984 -0.7625106 0.069921 -0.002765 -0.087162 -0.3951512 0.0010685 -0.0017809 0.0014372 -0.1869171 -0.4667116 -0.1673072 0.0002622 -0.4642433 -0.2476171 0.0000929 -0.0010489 0.0002261 -0.1692832 -0.1951258 -0.1120477 0.000193 0.3418108 -0.5835191 -0.0000625 -0.0009044 -0.0001794 -0.2069786 1.5924407 -0.2181891 0.0013472 -0.3115011 1.2685122 0.0039482 0.0011631 0.0029066 0.2370259 1.4289568 0.1005515 0.0045685 0.2758828 1.1096955 -0.0051512 0.0043095 -0.0035437 0.1809822 -0.3147955 0.5795956 0.000135 0.648932 -0.1754431 -0.0006189 0.0017508 0.0002362 0.0961653 0.0834878 -0.3899913 -0.000748 -0.3641378 0.1472457 0.0008616 0.0004481 0.0000245 0.1317259 0.0323238 0.1891714 0.0002542 -0.0184406 0.2800547 -0.0000659 -0.0002053 -0.0000633 -0.0199932 0.2943174 0.00775 -0.0000847 0.0643484 0.3163474 0.0001051 0.0001174 0.000009 0.3501765 0.1104104 -0.0277386 0.0000057 -0.0334207 0.0639612 -0.0000009 0.0002209 -0.0000455 0.1923139 unknown
polarizability: 106.408262|-3.4631711|98.7100397|0.0728864|-0.0129802|29.2703578 unknown
InChI: InChI=1S/C3H2N4O4/c8-6(9)2-3(7(10)11)5-1-4-2/h1,4H
charge 0 multiplicity 1
13 atoms
O  -1.585264 1.894245 0.005686
O  -2.953942 0.058635 -0.00133
O  1.192534 2.041473 -0.008148
O  2.95497 0.583359 0.005041
N  -0.98791 -1.652476 -0.000338
N  1.26405 -1.569322 0.000404
N  -1.778732 0.633386 0.001135
N  1.701244 0.857448 -0.001103
C  -0.654347 -0.299816 0.000016
C  0.762542 -0.280947 0.000076
C  0.1824 -2.380549 -0.000009
H  -1.964706 -1.965013 -0.000682
H  0.218561 -3.466424 -0.000048
