program: Gaussian 09
title: 000029485
version: EM64L-G09RevD.01
frameworkgroup: C1[X(C4H4N4O4)]
method: RPBEPBE
basis: SDD
operation: Freq
keyword: #pfreq=noraman
keyword: PBEPBE/SDD
title: #p freq=noraman PBEPBE/SDD
converged: NO NO NO NO
title: Mulliken charges:
elementType: O O O O N N N N C C C C H H H H
charge: -0.127556 -0.234083 -0.167037 -0.159754 -0.411990 -0.018125 0.040814 0.056960 0.281060 0.239127 0.090721 -0.740202 0.367800 0.249045 0.249157 0.284063
chargesum: 0.00000
title: Mulliken charges with hydrogens summed into heavy atoms:
elementType: O O O O N N N N C C C C
charge: -0.127556 -0.234083 -0.167037 -0.159754 -0.044190 -0.018125 0.040814 0.056960 0.281060 0.239127 0.090721 0.042062
polarizability: 1.23622398e+02 -5.15665327e+00 1.16251572e+02 1.21191865e-03 -7.15795436e-03 3.87087489e+01
1716.lowfreq: -63.4032 -6.5372 -0.0004 -0.0002 0.0007 3.9377 5.7370 49.6778 61.3178
frequency: -63.4029 49.6426 61.3170 143.4290 176.4591 180.0042 191.1667 298.5939 319.3290 380.3269 414.7082 453.6408 583.7575 611.6057 652.5903 688.3731 697.0084 726.9235 729.4825 783.5665 799.1374 974.9241 991.8391 1049.5172 1061.4247 1152.4196 1191.3534 1214.9453 1265.7917 1332.9006 1344.0423 1383.8513 1395.3404 1406.8862 1464.0414 1466.6503 1474.3036 1527.8907 2996.9766 3076.5762 3133.1631 3517.6403
redmass: 15.7034 11.3632 1.0461 4.4646 10.7007 7.9846 5.4420 6.2497 5.4676 11.8978 5.5123 9.1123 9.3924 6.8253 6.4276 6.1821 8.7837 9.7218 14.6407 9.9713 1.1928 2.0336 3.2974 1.5050 6.7678 4.7646 4.1450 3.4307 11.0018 5.8151 6.1680 7.3650 9.9016 1.3211 1.3018 1.0429 4.5974 5.0308 1.0390 1.0982 1.0976 1.0817
irintensity: 0.0059 0.6366 0.1147 0.7873 0.2294 6.1630 2.5226 2.3151 5.1521 1.5775 5.6152 1.0300 3.7827 6.9286 4.3882 5.3183 5.7886 3.7537 47.9803 24.4714 96.5925 3.4947 0.2832 6.8956 27.0776 43.5833 285.9077 137.6239 12.4481 17.2785 120.9007 18.2730 183.5691 18.5305 26.4957 21.0522 46.4264 130.8845 6.3186 7.8201 1.0534 106.3492
temp: 298.150 k
press: 1.00000 atm
elementType: 8 8 8 8 7 7 7 7 6 6 6 6 1 1 1 1
symmnumber: 1
zpe: 259371.6 jmol-1
zpe.correction: 0.098789 hartree
zpe.thermalcorrener: 0.108714 hartree
zpe.thermalcorrenthalpy: 0.109658 hartree
zpe.thermalcorrgfe: 0.062108 hartree
zpe.sumelectzpe: -673.650465 hartree
zpe.sumelectthermal: -673.640541 hartree
zpe.sumelectthermalent: -673.639597 hartree
zpe.sumelectthermalfe: -673.687146 hartree
dipole: 7.4424 2.5702 -0.0022
dipole: 7.8737
quadrupole: -63.6606 -85.1560 -64.9144
quadrupole: 4.3950 0.0025 0.0026
quadrupole: 7.5831 -13.9124 6.3293 4.3950 0.0025 0.0026
hfenergy: -673.7492543 hartree
pointgroup: C01 [X(C4H4N4O4)]
dipole: -2.7379199 1.4490961 0.0008479 debye
dipolederiv: -0.7761778 -0.0047249 -0.0002019 -0.0222232 -0.406968 0.0000855 -0.0000267 0.0000654 -0.1658005 -0.4531653 0.0906692 -0.0000505 -0.0565767 -0.9106608 0.0000697 -0.0000154 0.0002807 -0.2548375 -0.6379169 -0.0337709 -0.0002515 0.0666921 -0.5044439 -0.0001815 0.0003092 0.0000586 -0.1973274 -0.4042476 0.0323664 0.0001286 -0.0975275 -0.7753105 0.0000127 -0.0001602 -0.0005094 -0.1904763 -0.3385154 0.4382879 0.0001346 0.0517073 -0.5075811 -0.0000889 0.0000254 -0.0000356 -0.1763988 -0.8346718 -0.3361639 0.0000628 0.294595 -0.1615983 0.0000196 0.0000806 0.000158 -0.2146889 1.4353156 0.3678544 0.0002709 0.3492689 1.5237377 -0.0002066 0.0000693 -0.0003937 0.2306392 1.0848298 -0.2501562 -0.0000301 -0.0976779 1.4946887 0.0003874 0.0000043 0.0003022 0.1782916 -0.4382029 -0.6467522 -0.0000758 -0.6980639 -0.1772609 0.0001069 -0.0000951 0.0001229 0.0886112 0.8572581 -0.0093328 0.0000587 -0.3784197 0.0136748 -0.0000567 0.0004071 -0.0000325 0.0631325 0.3030503 0.3932538 0.0000207 0.4500285 -0.0189147 -0.0002071 -0.000181 -0.0000379 0.1312263 -0.234484 -0.0098785 0.0000251 0.1482309 0.0087579 0.0001395 -0.0008517 0.0000285 0.0537721 0.2881427 -0.0478949 0.0000063 0.0219909 0.2915997 0.0000202 -0.0000104 0.0000177 0.3326242 0.0260153 0.0087103 0.0111382 0.0247796 0.0697996 -0.0952902 0.0599377 -0.0840863 -0.0091656 0.025857 0.0087949 -0.0112868 0.0247343 0.0705515 0.0948702 -0.0597842 0.0838048 -0.0097545 0.0969127 -0.0012626 0.0000508 -0.0815387 -0.0100716 0.0003194 0.000291 0.0002568 0.1401524 unknown
polarizability: 125.0142445|3.7940448|114.8597251|0.0022974|0.0068867|38.7087489 unknown
InChI: InChI=1S/C4H4N4O4/c1-2-5-3(7(9)10)4(6-2)8(11)12/h5H,1H3
charge 0 multiplicity 1
16 atoms
O  2.43072 1.274017 0.000402
O  0.803668 2.887574 -0.000265
O  2.18477 -1.497827 -0.000446
O  0.489668 -3.032205 -0.000977
N  -1.164346 1.184263 0.0003
N  -1.399627 -1.05101 0.000266
N  1.207242 1.641842 0.000298
N  0.93853 -1.828501 0.000205
C  0.127422 0.664598 0.000309
C  -2.066738 0.132478 0.000273
C  -0.054141 -0.738974 0.000382
C  -3.551107 0.293794 0.00021
H  -1.332494 2.195496 0.000258
H  -3.901907 0.842832 0.892657
H  -3.902128 0.83943 -0.894257
H  -4.011133 -0.705207 0.002087
