program: Gaussian 09
title: 000029608
version: EM64L-G09RevD.01
frameworkgroup: C1[X(C21H26N2O3)]
method: RPBEPBE
basis: SDD
operation: Freq
keyword: #p
keyword: freq=noraman
keyword: PBEPBE/SDD
title: #p freq=noraman PBEPBE/SDD
converged: YES YES NO NO
title: Mulliken charges:
elementType: O O O N N C C C C C C C C C C C C C C C C C C C C C H H H H H H H H H H H H H H H H H H H H H H H H H H
charge: -0.317343 -0.274684 -0.285424 -0.081903 -0.461807 -0.364660 -0.371636 -0.391567 -0.385931 -0.398883 -0.356184 -0.264562 0.259301 0.481984 -0.369054 -0.433658 0.365563 -0.404104 -0.328583 -0.364504 0.411415 -0.407997 -0.393489 -0.225133 -0.218071 -0.240598 0.208792 0.174946 0.168321 0.212936 0.192945 0.207577 0.205438 0.192802 0.189027 0.215551 0.217814 0.199012 0.230222 0.239326 0.326875 0.298731 0.224407 0.223334 0.221637 0.248908 0.250312 0.227729 0.264305 0.226384 0.225804 0.228376
chargesum: 0.00000
title: Mulliken charges with hydrogens summed into heavy atoms:
elementType: O O O N N C C C C C C C C C C C C C C C C C C C C C
charge: -0.317343 -0.274684 -0.285424 -0.081903 -0.134932 0.019079 0.009620 0.008955 0.012309 0.005695 0.060643 0.204986 0.259301 0.481984 -0.070323 -0.209251 0.365563 0.040868 -0.079675 -0.114193 0.411415 -0.180268 -0.129183 0.001251 0.007733 -0.012222
polarizability: 4.19330752e+02 -4.98685182e-01 2.23467934e+02 4.85161788e+00 1.79328701e+01 1.50797500e+02
1716.lowfreq: -9.0905 -3.9972 -0.0019 0.0015 0.0019 0.9377 6.5462 14.4352 20.6954
frequency: -5.5447 14.0414 20.1467 26.8367 30.4396 52.7379 57.6202 66.0727 80.5183 99.1721 104.5643 114.4548 137.9199 170.1702 187.4893 204.5987 228.5220 239.3141 252.0898 273.2234 316.9389 346.6601 355.0081 369.8004 381.9908 401.8158 411.1560 413.6920 451.5836 453.0577 463.4827 482.8739 521.2388 540.6104 564.0263 612.8320 618.2982 629.9790 633.5242 695.5414 700.1925 702.8394 716.8264 741.2316 758.0053 781.1999 793.0174 808.2789 813.6842 820.5120 831.1569 841.1113 854.8502 855.6512 858.4048 906.5673 912.0512 916.5202 939.9871 960.2693 964.4127 978.9135 983.8827 989.8665 994.4533 995.6935 997.8228 1013.8525 1017.2960 1028.0428 1045.6265 1049.3355 1084.9770 1089.2093 1101.4461 1114.4516 1123.3038 1125.8937 1150.5273 1159.2827 1161.8063 1171.9551 1179.2246 1183.5228 1186.1982 1204.1366 1214.3830 1227.1708 1245.6423 1258.8350 1261.2975 1265.9801 1283.1996 1293.5706 1309.0514 1313.9899 1318.0325 1332.4640 1342.6507 1348.0149 1353.8019 1355.7173 1370.4750 1379.1285 1390.5746 1396.7034 1422.9865 1440.2798 1452.7652 1461.5804 1464.4579 1469.8737 1470.0056 1473.5181 1481.1139 1485.0460 1486.2803 1500.6372 1516.7971 1595.0788 1596.7152 1619.2443 1633.4769 1661.3733 2821.1496 2831.4808 2891.2997 2931.8761 2969.1205 2985.7477 2988.0017 2989.2236 3019.1255 3024.4890 3031.1404 3037.2062 3039.9251 3047.3225 3056.5759 3091.6387 3113.0035 3120.3027 3127.2773 3141.1667 3158.7527 3158.8331 3167.6388 3172.6082 3187.5687 3546.2281
redmass: 3.9425 5.0469 3.9796 5.6449 3.8887 4.3991 5.6340 5.5062 3.6865 3.9574 3.3348 5.2554 3.2909 3.9964 5.2708 4.6252 3.9195 2.0602 2.8478 4.4250 2.3392 5.1374 4.5619 5.8933 2.0636 2.8336 2.9237 3.0947 2.9746 3.3839 3.4114 3.5442 2.4096 4.5097 2.0853 6.2736 6.2268 6.9615 1.2610 6.3546 5.0273 2.4928 3.7251 1.4601 3.5048 4.2344 1.3394 1.4110 1.2920 4.0882 1.6254 5.6062 2.4334 1.2536 1.5238 2.4678 1.3264 6.2654 1.3603 1.2976 1.3222 1.3982 7.3104 6.1646 3.0033 1.3369 2.9466 3.2326 2.0174 2.1347 1.9376 1.9325 1.5751 2.9272 1.5811 2.0756 1.3035 2.0733 1.3371 2.6082 2.4952 1.0540 1.1935 1.3136 1.1132 1.2173 1.9849 2.4122 1.6522 1.2575 2.2807 1.1859 1.2227 1.4021 1.3716 1.4261 1.3485 1.2976 1.4193 1.4927 1.4950 1.6493 1.4875 4.0477 3.9815 1.5196 3.8633 2.1503 1.0913 1.0879 1.0816 1.1452 1.0892 1.0907 1.0978 1.1131 2.2102 2.0795 2.5437 5.6251 6.0406 6.0755 6.4918 8.7019 1.0716 1.0700 1.0698 1.0570 1.0626 1.0614 1.0615 1.1032 1.0584 1.0878 1.0898 1.0933 1.0890 1.1034 1.1036 1.1086 1.0876 1.0899 1.0868 1.0929 1.0973 1.0896 1.0948 1.0975 1.0951 1.0761
irintensity: 0.3626 0.3282 0.1894 0.0506 0.1611 0.2928 1.8946 4.3338 0.5255 1.0391 0.6149 1.0050 7.3200 3.5059 0.1826 1.0699 2.9995 3.1401 3.6497 7.7111 8.5682 1.6678 9.3538 2.9836 6.4754 0.4217 16.6054 0.1652 0.4060 4.5018 4.9390 9.3890 29.0021 0.2194 1.7055 3.7416 1.5563 10.0483 48.2492 38.9796 33.1486 33.1338 0.1703 71.7823 10.2835 18.3503 1.9754 0.0743 9.0215 7.8478 103.9270 1.1478 4.5040 0.1661 9.9408 1.8937 5.2052 6.9937 0.6221 2.7823 2.6436 2.1847 195.6669 0.5391 8.5071 0.9400 117.8030 176.9050 22.3023 11.3198 46.5264 19.8099 9.1263 31.0074 34.7105 27.2400 24.6934 5.6364 5.9051 585.5517 181.6840 0.2523 5.4296 2.5558 4.7540 1.2105 197.6701 122.7612 7.0830 4.1959 28.1099 4.0243 10.8363 11.2003 3.8258 36.7551 4.3237 0.6835 0.5601 1.0133 6.6800 30.9449 0.8044 46.8708 2.5521 0.8168 64.1972 17.3132 7.1722 14.4788 0.4801 73.3314 0.1647 37.7187 16.0559 21.7828 7.1079 9.5815 919.8528 11.7176 8.4529 7.8743 2.7616 243.9325 46.8619 152.7345 93.3260 26.8000 39.3873 34.2012 32.4421 30.3881 28.8426 50.5073 62.5150 34.2597 25.8118 19.8347 96.9644 35.2256 10.0288 21.5520 0.7461 30.1159 44.8612 5.8496 5.4797 8.8157 6.5903 29.3515
temp: 298.150 k
press: 1.00000 atm
elementType: 8 8 8 7 7 6 6 6 6 6 6 6 6 6 6 6 6 6 6 6 6 6 6 6 6 6 1 1 1 1 1 1 1 1 1 1 1 1 1 1 1 1 1 1 1 1 1 1 1 1 1 1
symmnumber: 1
zpe: 1135089.5 jmol-1
zpe.correction: 0.432333 hartree
zpe.thermalcorrener: 0.456002 hartree
zpe.thermalcorrenthalpy: 0.456946 hartree
zpe.thermalcorrgfe: 0.375405 hartree
zpe.sumelectzpe: -1149.072058 hartree
zpe.sumelectthermal: -1149.048389 hartree
zpe.sumelectthermalent: -1149.047445 hartree
zpe.sumelectthermalfe: -1149.128986 hartree
dipole: -1.3842 1.3709 0.5862
dipole: 2.0344
quadrupole: -123.8727 -145.5501 -157.6759
quadrupole: -11.8262 -2.2126 3.0213
quadrupole: 18.4935 -3.1839 -15.3097 -11.8262 -2.2126 3.0213
hfenergy: -1149.5043904 hartree
pointgroup: C01 [X(C21H26N2O3)]
dipole: 0.5440149 -0.3702092 0.4556677 debye
polarizability: 419.3686289|-1.9216972|193.234505|-3.127536|-40.0735454|180.9930525 unknown
InChI: InChI=1S/C21H26N2O3/c24-21(25-16-15-23-13-5-2-6-14-23)22-19-9-11-20(12-10-19)26-17-18-7-3-1-4-8-18/h1,3-4,7-12,22H,2,5-6,13-17H2
charge 0 multiplicity 1
52 atoms
O  3.315443 -0.701501 0.226068
O  1.947025 0.931078 -0.786083
O  -4.562567 -0.466897 0.208452
N  6.978668 -0.026749 -0.102667
N  1.077091 -0.926028 0.408528
C  7.315548 1.089025 0.8196
C  8.132443 -0.943164 -0.294809
C  8.50729 1.909758 0.286918
C  9.349298 -0.183512 -0.863097
C  9.734185 0.999127 0.054079
C  5.730539 -0.727999 0.278556
C  4.513384 0.023112 -0.276435
C  2.075345 -0.125744 -0.117874
C  -0.330996 -0.737246 0.313594
C  -0.923822 0.344353 -0.382616
C  -1.167143 -1.694042 0.952506
C  -3.156211 -0.490368 0.202758
C  -5.220331 0.650342 -0.482015
C  -2.330159 0.464718 -0.437121
C  -2.564625 -1.573214 0.89841
C  -6.721845 0.521492 -0.303804
C  -7.586428 1.150942 -1.233691
C  -7.278249 -0.178544 0.793775
C  -8.987515 1.093959 -1.063036
C  -8.680315 -0.241908 0.960023
C  -9.539749 0.396387 0.036286
H  6.430019 1.741047 0.931716
H  7.567872 0.696056 1.84112
H  8.428637 -1.433739 0.67101
H  7.826458 -1.745161 -0.99222
H  8.748585 2.71574 1.006388
H  8.2129 2.386961 -0.667559
H  9.089081 0.198638 -1.869105
H  10.198834 -0.884107 -0.977332
H  10.092073 0.60761 1.029137
H  10.56804 1.576544 -0.387734
H  5.743252 -1.745464 -0.1529
H  5.621802 -0.844033 1.384109
H  4.469494 1.071286 0.068719
H  4.511434 0.01921 -1.379858
H  1.40776 -1.744393 0.923764
H  -0.286085 1.081169 -0.875427
H  -0.721149 -2.537625 1.494208
H  -4.857334 1.607176 -0.046698
H  -4.953342 0.640224 -1.559278
H  -2.758916 1.308281 -0.985695
H  -3.214382 -2.306249 1.385514
H  -7.166869 1.685277 -2.09587
H  -6.608578 -0.67936 1.498766
H  -9.645324 1.584518 -1.78925
H  -9.101477 -0.790055 1.810482
H  -10.626486 0.346773 0.167488
