program: Gaussian 09
title: 000029498
version: EM64L-G09RevD.01
frameworkgroup: C1[X(C13H18N4)]
method: RPBEPBE
basis: SDD
operation: Freq
keyword: #pfreq=noraman
keyword: PBEPBE/SDD
title: #p freq=noraman PBEPBE/SDD
converged: YES YES NO NO
title: Mulliken charges:
elementType: N N N N C C C C C C C C C C C C C H H H H H H H H H H H H H H H H H H
charge: -0.047718 -0.203552 -0.036215 -0.105205 -0.011589 -0.413500 -0.408497 -0.384344 -0.380957 -0.366178 -0.726412 0.330353 -0.049355 -0.312071 -0.276921 -0.211277 -0.220042 0.189757 0.193405 0.209337 0.208999 0.192688 0.234214 0.169739 0.173721 0.218813 0.242827 0.195690 0.212706 0.212259 0.212446 0.244280 0.254413 0.226918 0.231271
chargesum: 0.00000
title: Mulliken charges with hydrogens summed into heavy atoms:
elementType: N N N N C C C C C C C C C C C C C
charge: -0.047718 -0.203552 -0.036215 -0.105205 0.178167 -0.010759 -0.006810 0.019608 0.011577 0.072338 -0.089001 0.330353 -0.049355 -0.067791 -0.022508 0.015642 0.011228
polarizability: 2.05444414e+02 2.25785472e+01 1.59467022e+02 -1.57494585e+01 1.33904809e+01 1.26111937e+02
1716.lowfreq: -13.2535 -5.3404 -0.0005 0.0007 0.0008 14.6293 18.2198 35.1037 43.8573
frequency: 2.7358 34.3177 43.7660 95.5686 157.7456 177.0547 207.7620 218.3135 220.1474 244.4842 276.3508 299.5953 319.0230 343.0502 422.5388 427.2237 440.3830 461.5376 473.6061 536.1835 568.2557 598.1757 607.6828 640.3158 736.2295 748.0713 756.5447 761.6431 765.3901 800.2649 806.6996 852.2534 855.5069 892.1001 906.9225 945.5206 952.1810 966.1156 971.8221 982.3850 1001.3389 1006.5549 1027.2546 1067.6666 1084.0659 1096.3454 1110.6508 1126.3970 1135.0403 1150.2957 1163.9870 1165.6458 1195.1344 1215.0640 1216.4940 1251.3584 1263.3368 1278.7724 1286.0026 1301.9361 1310.4072 1314.0846 1337.7852 1342.9487 1355.0022 1361.0765 1384.3342 1387.4145 1398.6441 1413.1852 1446.5273 1447.6533 1454.1799 1459.8225 1467.4394 1474.1281 1475.8262 1478.0053 1479.7648 1587.7448 1621.6965 2815.9477 2831.7930 2870.1905 2940.5085 2967.2553 2980.6059 2984.0265 3024.7882 3038.1238 3042.5537 3047.1179 3064.2552 3066.7293 3068.5873 3134.3535 3149.5980 3162.9001 3178.0021
redmass: 3.0754 4.8337 4.3071 3.7201 3.9768 3.6943 1.3983 2.8503 2.6036 1.9898 2.2193 4.5509 2.6309 2.0966 2.8658 2.9184 2.3472 4.8470 2.8687 6.6927 3.7438 2.4787 5.6264 6.7124 5.0281 3.1152 4.2608 1.6249 4.4781 2.2169 1.5053 2.4473 1.6976 3.9502 2.8143 1.3685 1.3076 1.3128 2.1093 1.3080 1.8948 1.9312 2.9652 1.9698 4.3720 2.3775 2.3810 1.6316 2.1027 1.4286 1.4207 2.0655 2.9452 2.3056 2.8039 1.6091 1.3262 1.4052 1.5120 1.4401 1.3280 1.3080 1.3330 1.4656 1.8233 1.7299 1.8099 1.2325 1.3326 2.9013 1.2847 2.4490 1.1587 1.0910 1.0813 1.0622 2.3888 1.0636 1.2246 7.2911 7.6451 1.0710 1.0703 1.0706 1.0823 1.0361 1.0593 1.0603 1.0873 1.0884 1.1021 1.1027 1.0994 1.0994 1.0885 1.0858 1.0900 1.0963 1.0990
irintensity: 0.0984 1.8000 0.0824 0.3703 1.6182 0.0991 0.3599 0.0856 0.1442 0.6892 2.1008 1.4748 2.6160 5.3084 1.1311 6.7618 0.1722 1.2228 1.6085 0.5628 2.1000 0.6682 3.3976 1.9386 6.2091 13.5899 10.7507 70.0498 17.4323 6.0750 0.0786 33.0873 13.4377 4.4636 53.6327 1.1182 6.8212 6.3705 35.4532 0.1817 21.3721 7.7875 10.4539 51.4624 4.5663 15.7490 52.4859 12.0549 1.5949 10.8622 5.3373 62.7776 17.8611 0.6146 8.1887 9.2650 3.1734 10.9286 9.2518 19.1506 0.7018 3.7485 12.6057 56.1144 19.8451 9.0750 1.7332 10.7778 8.5091 15.0872 2.7868 9.1632 7.5149 11.9666 2.1281 15.1588 24.4029 10.1776 8.2539 3.6816 13.7756 56.3547 119.1295 119.3882 28.0602 32.6592 36.2130 43.9019 46.3815 28.4146 8.8403 40.5774 81.1625 39.5379 15.1501 1.8651 13.2759 18.7384 14.9261
temp: 298.150 k
press: 1.00000 atm
elementType: 7 7 7 7 6 6 6 6 6 6 6 6 6 6 6 6 6 1 1 1 1 1 1 1 1 1 1 1 1 1 1 1 1 1 1
symmnumber: 1
zpe: 771733.8 jmol-1
zpe.correction: 0.293938 hartree
zpe.thermalcorrener: 0.308951 hartree
zpe.thermalcorrenthalpy: 0.309895 hartree
zpe.thermalcorrgfe: 0.248638 hartree
zpe.sumelectzpe: -723.877628 hartree
zpe.sumelectthermal: -723.862615 hartree
zpe.sumelectthermalent: -723.861670 hartree
zpe.sumelectthermalfe: -723.922928 hartree
dipole: -1.9733 3.6142 3.3036
dipole: 5.2792
quadrupole: -94.4521 -105.9570 -101.9076
quadrupole: 10.8031 -0.0066 -4.4872
quadrupole: 6.3202 -5.1847 -1.1354 10.8031 -0.0066 -4.4872
hfenergy: -724.1715655 hartree
pointgroup: C01 [X(C13H18N4)]
dipole: -0.6650482 1.4584829 -1.3207576 debye
polarizability: 206.438622|-15.5686608|130.0913847|-22.3577551|-16.1595691|154.4933653 unknown
InChI: InChI=1S/C13H18N4/c1-11-6-8-16(9-7-11)10-17-13-5-3-2-4-12(13)14-15-17/h2-5,11H,6-10H2,1H3
charge 0 multiplicity 1
35 atoms
N  -1.519454 0.493632 0.64753
N  0.868037 0.279527 1.167789
N  1.098786 -0.740833 2.138422
N  2.247767 -1.352141 1.829862
C  -4.046932 0.133415 -0.830549
C  -2.67643 -0.283743 -1.417233
C  -3.970224 0.074255 0.715169
C  -1.526953 0.560588 -0.832607
C  -2.80219 0.922255 1.256873
C  -0.343424 1.107558 1.267633
C  -5.19408 -0.739833 -1.379904
C  1.902044 0.29954 0.242286
C  2.780183 -0.749849 0.668895
C  2.189178 1.094611 -0.894378
C  3.97104 -1.036555 -0.040685
C  3.377992 0.799668 -1.586998
C  4.257085 -0.250637 -1.170796
H  -4.236314 1.190464 -1.122816
H  -2.681634 -0.179384 -2.519919
H  -2.490123 -1.350365 -1.183047
H  -3.825386 -0.977265 1.031677
H  -4.918864 0.432567 1.161048
H  -0.560261 0.17871 -1.207561
H  -1.63002 1.622852 -1.185189
H  -3.016343 2.004779 1.051642
H  -2.7236 0.800997 2.353527
H  -0.545352 1.24728 2.342679
H  -0.080427 2.102303 0.828887
H  -6.172434 -0.420185 -0.974624
H  -5.248879 -0.684094 -2.483352
H  -5.044364 -1.80098 -1.102488
H  1.526554 1.900769 -1.224609
H  4.635555 -1.840052 0.290051
H  3.640498 1.390346 -2.471786
H  5.16887 -0.4392 -1.747129
