program: Gaussian 09
title: 000029488
version: EM64L-G09RevD.01
frameworkgroup: C1[X(C11H15NO3)]
method: RPBEPBE
basis: SDD
operation: Freq
keyword: #p
keyword: freq=noraman
keyword: PBEPBE/SDD
title: #p freq=noraman PBEPBE/SDD
converged: NO YES NO NO
title: Mulliken charges:
elementType: O O O N C C C C C C C C C C C H H H H H H H H H H H H H H H
charge: -0.338767 -0.442527 -0.279428 -0.376435 -0.203525 0.436050 -0.706486 -0.690713 0.081320 -0.580329 0.364334 -0.367618 -0.320385 0.291317 -0.607074 0.252008 0.227129 0.201913 0.214781 0.232872 0.210444 0.210253 0.254342 0.215614 0.302909 0.355750 0.330189 0.272220 0.229749 0.230094
chargesum: 0.00000
title: Mulliken charges with hydrogens summed into heavy atoms:
elementType: O O O N C C C C C C C C C C C
charge: -0.338767 -0.086778 -0.279428 -0.046246 0.048484 0.436050 -0.062663 -0.037145 0.081320 -0.325988 0.364334 -0.152004 -0.017476 0.291317 0.124989
polarizability: 1.98607948e+02 5.87693810e+00 1.45760629e+02 -7.02992198e-01 -3.82303274e-01 8.02624450e+01
1716.lowfreq: -27.0165 -6.0570 0.0006 0.0007 0.0008 7.6425 10.9006 19.8347 41.8243
frequency: -25.9931 19.5558 41.8069 97.2970 105.7967 111.3556 137.4364 166.3605 171.8687 217.8364 242.5643 253.1992 265.7552 306.0192 312.3484 343.0050 351.2444 379.0634 403.8869 472.9521 511.5061 517.7678 579.5185 585.0886 606.8367 666.2535 684.1028 716.8230 735.9052 756.5695 807.3122 845.1684 886.5744 899.5006 921.3777 939.5609 942.0015 956.6904 1062.2582 1077.4403 1094.0671 1116.3831 1126.8805 1135.6376 1146.9770 1159.7530 1178.1609 1195.2254 1208.9233 1253.2167 1275.8243 1316.0853 1350.1058 1375.6722 1389.7596 1397.2594 1426.5171 1431.8397 1459.6650 1466.6438 1466.7225 1481.0874 1484.5540 1484.7657 1493.0720 1514.3827 1598.8317 1621.3863 1683.7175 2971.0438 2975.6554 2979.4153 3023.3044 3056.7912 3063.0649 3072.7981 3077.6750 3082.2823 3112.5378 3113.9638 3157.2793 3209.4570 3579.8090 3586.0958
redmass: 2.7452 5.9689 4.8785 3.8467 1.0924 3.3547 4.0338 3.5386 4.4706 1.1008 1.0606 3.8653 4.8336 4.2931 3.8325 1.1004 4.9298 5.2737 2.9443 3.0081 3.2857 4.5362 1.2744 3.6523 3.7094 5.9754 12.1821 6.1620 3.3567 4.6251 1.4817 4.2594 2.9810 1.5248 1.1976 1.6707 2.0329 1.4431 2.4243 2.2828 2.1211 2.6096 1.2816 1.7260 1.6901 1.4275 2.0419 2.0886 1.9046 3.2092 1.6156 1.2968 1.5641 1.2081 3.0705 1.4970 2.0762 1.3935 1.3714 1.0575 1.0545 1.1019 1.0450 1.1517 2.0001 1.4031 6.8295 7.0439 9.1872 1.0348 1.0357 1.0355 1.0850 1.1026 1.0999 1.0983 1.1003 1.0994 1.0981 1.0906 1.0912 1.0942 1.0773 1.0660
irintensity: 0.0304 3.6517 5.9828 2.7660 0.0888 2.9704 1.1304 1.2620 0.8610 0.0686 0.0555 6.7262 4.5928 1.2750 6.6173 130.6092 14.0989 1.6469 4.3940 12.1431 2.1196 5.8334 110.2831 21.5244 13.6309 5.0448 24.7025 2.9044 0.2685 26.0670 52.1016 9.8587 22.1433 25.3831 4.2990 23.2385 37.8930 3.7041 104.9260 99.9942 12.4935 41.9087 0.0946 485.0857 5.3091 66.7489 261.7134 118.8957 61.6672 6.7889 73.7896 0.6342 4.9727 15.8181 8.0444 17.7143 140.9931 65.9241 178.7228 7.6670 2.0370 4.0037 15.6677 17.6566 158.6045 129.5897 5.1257 3.2257 246.4531 34.7713 33.5331 90.0609 0.4441 37.7454 1.1517 100.4884 26.0489 38.7276 3.6077 21.5282 3.9672 4.8931 41.3099 32.5979
temp: 298.150 k
press: 1.00000 atm
elementType: 8 8 8 7 6 6 6 6 6 6 6 6 6 6 6 1 1 1 1 1 1 1 1 1 1 1 1 1 1 1
symmnumber: 1
zpe: 636963.0 jmol-1
zpe.correction: 0.242606 hartree
zpe.thermalcorrener: 0.257939 hartree
zpe.thermalcorrenthalpy: 0.258884 hartree
zpe.thermalcorrgfe: 0.199304 hartree
zpe.sumelectzpe: -707.467435 hartree
zpe.sumelectthermal: -707.452102 hartree
zpe.sumelectthermalent: -707.451158 hartree
zpe.sumelectthermalfe: -707.510737 hartree
dipole: -0.9126 -1.4423 0.2695
dipole: 1.7279
quadrupole: -77.1681 -77.0539 -92.7495
quadrupole: 15.1355 -1.3891 0.0442
quadrupole: 5.1558 5.2699 -10.4257 15.1355 -1.3891 0.0442
hfenergy: -707.7100414 hartree
pointgroup: C01 [X(C11H15N1O3)]
dipole: 0.4061548 0.540289 -0.0725894 debye
polarizability: 199.0230685|0.3304622|139.8230497|-4.9236449|-17.8224|85.7849041 unknown
InChI: InChI=1S/C11H15NO3/c1-7(2)9-6-8(4-5-10(9)13)15-11(14)12-3/h4-7,12-13H,1-3H3
charge 0 multiplicity 1
30 atoms
O  1.863047 0.457891 -0.064855
O  -3.379598 -1.498357 0.598858
O  3.280542 -1.43982 0.263821
N  4.091918 0.71104 -0.218719
C  -3.016912 1.195438 -0.247998
C  -1.83121 0.260928 -0.00092
C  -2.855889 2.051973 -1.527202
C  -3.254667 2.096519 0.997153
C  -2.039149 -1.076494 0.437472
C  -0.49476 0.692022 -0.147375
C  0.592657 -0.167666 0.122016
C  -0.951161 -1.937741 0.700953
C  0.381681 -1.497005 0.548836
C  3.107549 -0.220485 0.018618
C  5.512939 0.358899 -0.210495
H  -3.912243 0.559111 -0.369567
H  -2.674517 1.419181 -2.414679
H  -2.016344 2.767218 -1.44095
H  -3.773333 2.64288 -1.705933
H  -3.422766 1.485012 1.901499
H  -4.140466 2.741605 0.84588
H  -2.380284 2.748839 1.18243
H  -0.277641 1.711637 -0.480404
H  -1.134253 -2.969095 1.031123
H  1.223339 -2.161598 0.743707
H  -3.410409 -2.445478 0.881546
H  3.794135 1.668157 -0.407396
H  5.595535 -0.715805 0.016451
H  6.062833 0.927201 0.562324
H  5.980027 0.548092 -1.194894
