program: Gaussian 09
title: 000029449
version: EM64L-G09RevD.01
frameworkgroup: C1[X(C14H18N2)]
method: RPBEPBE
basis: SDD
operation: Freq
keyword: #pfreq=noraman
keyword: PBEPBE/SDD
title: #p freq=noraman PBEPBE/SDD
converged: YES YES NO NO
title: Mulliken charges:
elementType: N N C C C C C C C C C C C C C C H H H H H H H H H H H H H H H H H H
charge: -0.127671 -0.161506 -0.150216 -0.473322 -0.435697 -0.377150 0.364912 0.091041 -0.444443 -0.648154 0.259352 -0.421997 -0.355692 -0.638739 -0.254697 -0.232828 0.200338 0.233501 0.211219 0.205929 0.223256 0.170466 0.225438 0.284829 0.220441 0.186014 0.243899 0.230216 0.230075 0.236133 0.232768 0.236750 0.217490 0.218047
chargesum: 0.00000
title: Mulliken charges with hydrogens summed into heavy atoms:
elementType: N N C C C C C C C C C C C C C C
charge: -0.127671 -0.161506 0.050122 -0.028602 -0.006512 0.018754 0.364912 0.091041 -0.159615 0.002200 0.259352 -0.191781 -0.125617 0.066912 -0.037207 -0.014782
polarizability: 2.08846892e+02 1.08355360e+01 1.71937119e+02 -1.65751674e+00 -6.42167046e+00 1.06031323e+02
1716.lowfreq: -28.8882 -11.4666 -0.0007 -0.0005 0.0000 5.0003 9.2925 35.5865 45.5138
frequency: -26.2936 35.0431 45.0652 77.6434 112.4378 134.0602 177.8146 192.2851 208.2589 235.5818 241.3649 264.3439 303.7251 357.3331 406.0836 427.4613 516.4001 533.1226 558.8322 574.0159 578.8342 617.4639 640.9658 655.6086 746.6105 751.0576 763.6427 766.1581 817.5191 825.8638 847.7390 864.2873 887.8439 925.2253 927.6338 955.3043 967.4937 1009.3506 1010.5647 1039.1764 1042.9756 1055.1580 1079.3713 1108.1117 1117.6167 1119.7547 1128.6241 1137.6663 1165.8681 1180.4151 1186.8619 1202.8376 1222.0783 1231.1395 1245.5671 1276.2973 1290.6122 1307.5706 1309.0163 1335.5318 1340.3227 1364.3446 1392.8774 1411.8920 1429.6703 1434.2006 1462.2357 1465.9083 1467.7216 1472.2224 1477.5988 1479.6178 1480.2156 1488.9791 1495.4001 1557.8401 1579.7623 1625.0981 2810.4234 2834.5993 2855.3933 2973.2299 3010.2942 3019.1650 3021.6062 3034.2094 3047.8776 3068.9163 3080.3189 3091.3969 3105.7324 3120.0051 3129.5056 3142.9571 3160.0001 3226.1285
redmass: 2.4340 2.9917 1.0876 3.4143 3.4058 2.9508 2.0844 3.4248 3.4911 1.1259 3.7594 3.1025 2.4379 3.8807 3.5898 2.9184 3.6410 5.3983 3.2587 3.8217 5.6224 2.9298 3.3193 3.2551 1.3388 3.3404 3.1635 3.7190 2.1020 1.5477 1.5002 2.6224 1.9681 2.4248 1.4156 2.0658 1.3018 2.9773 2.1544 2.3062 2.1209 2.0831 2.0351 1.2939 1.3074 1.9225 1.5263 1.4570 1.2165 1.6996 1.5266 1.8071 1.6944 1.6770 1.7897 1.2811 1.2788 1.5915 1.4293 2.3606 1.7140 3.1296 2.1858 4.2812 1.1885 1.5619 1.0821 1.0424 1.0565 2.5179 1.1178 1.1831 2.0230 1.1044 1.1864 6.4557 6.7277 7.2898 1.0802 1.0704 1.0582 1.0358 1.0599 1.0685 1.0721 1.0827 1.1017 1.1034 1.1005 1.1051 1.0982 1.0846 1.0886 1.0951 1.1001 1.0979
irintensity: 0.5197 0.2941 0.2492 1.9967 1.3563 3.0435 0.9513 1.3336 1.3702 2.1405 0.5700 0.6234 5.3598 1.0909 2.0188 7.3846 3.0393 3.7236 6.3252 0.0963 2.6959 0.6019 0.4587 4.8690 105.2321 0.1322 6.1876 3.5919 3.1613 16.4714 0.1489 12.9535 15.3326 3.6991 2.9175 2.6430 0.0137 5.0720 13.2221 9.1085 30.1121 22.4630 2.4620 8.1941 0.7718 15.6750 15.8465 6.8258 10.5024 5.1396 9.6391 25.7541 10.3840 1.9839 24.1367 6.6730 6.4584 22.4544 1.9382 11.1892 7.2986 18.0715 6.8811 30.5540 7.4291 1.3074 4.1362 10.6145 19.6124 14.2445 12.0223 21.0857 34.7739 1.9688 8.5296 12.2227 0.5047 4.6559 42.6267 86.2911 197.9150 82.2297 20.9970 43.0894 47.7005 65.5610 29.8621 7.4010 31.6704 55.9773 11.7327 2.0085 5.4050 41.6532 32.3258 0.0227
temp: 298.150 k
press: 1.00000 atm
elementType: 7 7 6 6 6 6 6 6 6 6 6 6 6 6 6 6 1 1 1 1 1 1 1 1 1 1 1 1 1 1 1 1 1 1
symmnumber: 1
zpe: 759030.3 jmol-1
zpe.correction: 0.289099 hartree
zpe.thermalcorrener: 0.303175 hartree
zpe.thermalcorrenthalpy: 0.304119 hartree
zpe.thermalcorrgfe: 0.247589 hartree
zpe.sumelectzpe: -652.600028 hartree
zpe.sumelectthermal: -652.585952 hartree
zpe.sumelectthermalent: -652.585008 hartree
zpe.sumelectthermalfe: -652.641538 hartree
dipole: 0.2693 1.7433 -0.1526
dipole: 1.7706
quadrupole: -88.4570 -84.9532 -99.1277
quadrupole: -7.0286 1.4994 -1.8047
quadrupole: 2.3890 5.8928 -8.2817 -7.0286 1.4994 -1.8047
hfenergy: -652.8891274 hartree
pointgroup: C01 [X(C14H18N2)]
dipole: 0.1190597 0.628083 0.2767251 debye
polarizability: 209.1527582|8.0881217|161.7791383|7.1149177|24.1496408|115.8834374 unknown
InChI: InChI=1S/C14H18N2/c1-15-9-5-8-14(15)12-10-16(2)13-7-4-3-6-11(12)13/h3-4,6-7,10,14H,5,8-9H2,1-2H3
charge 0 multiplicity 1
34 atoms
N  2.705526 0.007395 0.763684
N  -1.307552 1.627563 0.500291
C  1.675798 -0.56062 -0.1591
C  2.298629 -0.36031 -1.590912
C  3.774305 0.083541 -1.344245
C  4.019407 -0.267716 0.138348
C  0.321722 0.075103 0.03873
C  -0.972966 -0.517609 -0.243246
C  0.075613 1.373544 0.484745
C  2.58186 -0.435772 2.160928
C  -1.973758 0.478281 0.055315
C  -1.393537 -1.789408 -0.716705
C  -3.356273 0.23416 -0.10441
C  -1.954684 2.868507 0.924048
C  -2.770916 -2.038646 -0.876996
C  -3.742264 -1.038025 -0.574741
H  1.570578 -1.66416 0.017679
H  1.733914 0.398554 -2.156872
H  2.248324 -1.305535 -2.159842
H  4.490408 -0.419171 -2.01765
H  3.874837 1.173364 -1.48761
H  4.314492 -1.345532 0.239267
H  4.810704 0.344342 0.608311
H  0.796327 2.125107 0.800759
H  3.336664 0.074686 2.786074
H  2.720047 -1.541021 2.281925
H  1.580745 -0.173849 2.544887
H  -0.65911 -2.567171 -0.956168
H  -4.106959 0.998431 0.125492
H  -2.625312 2.695246 1.786823
H  -1.184733 3.59703 1.223884
H  -2.548876 3.308795 0.101341
H  -3.107924 -3.016029 -1.240669
H  -4.806133 -1.262973 -0.711365
