program: Gaussian 09
title: 000029481
version: EM64L-G09RevD.01
frameworkgroup: C1[X(C22H30N)]
method: RPBEPBE
basis: SDD
operation: Freq
keyword: #p
keyword: freq=noraman
keyword: PBEPBE/SDD
title: #p freq=noraman PBEPBE/SDD
converged: NO YES NO NO
title: Mulliken charges:
elementType: N C C C C C C C C C C C C C C C C C C C C C C H H H H H H H H H H H H H H H H H H H H H H H H H H H H H H
charge: -0.157696 0.520950 -0.527435 -0.494216 -0.698529 -0.431873 -0.437446 -0.410654 -0.527905 -0.614279 -0.623212 0.511108 0.437988 -0.409794 -0.395176 -0.388592 -0.367083 -0.237037 -0.236508 -0.228959 -0.234852 -0.225948 -0.215995 0.208284 0.259821 0.239028 0.192502 0.252342 0.219865 0.222736 0.230537 0.259334 0.224357 0.283072 0.268591 0.232969 0.225365 0.277648 0.265864 0.279280 0.287612 0.253160 0.275623 0.231073 0.225158 0.244251 0.235969 0.244071 0.243956 0.251781 0.252035 0.249424 0.257435
chargesum: 1.00000
title: Mulliken charges with hydrogens summed into heavy atoms:
elementType: N C C C C C C C C C C C C C C C C C C C C C C
charge: -0.157696 0.520950 -0.059330 -0.062686 -0.226321 0.021400 0.046245 0.047680 0.023758 0.208513 0.193183 0.511108 0.437988 -0.178721 -0.170018 -0.144341 -0.131114 0.007034 0.007449 0.022821 0.017183 0.023475 0.041441
polarizability: 3.15432830e+02 1.90288979e+00 2.01314722e+02 1.45358035e+00 -1.03176574e+00 1.82684067e+02
1716.lowfreq: -6.7098 -0.0007 -0.0007 -0.0003 5.8442 8.0224 19.2597 30.5012 56.4755
frequency: 17.4217 30.3434 56.4601 66.0299 76.1543 83.8227 99.0179 130.9628 155.9268 183.6959 194.2387 204.4250 239.8548 267.1442 269.9844 296.3199 302.8524 327.8033 334.2354 344.8146 362.6418 374.1932 404.7713 406.5816 409.1018 419.9210 434.6246 451.1470 490.5070 504.2156 537.2111 554.5764 562.2578 616.9374 617.6235 630.3609 651.4793 696.4312 704.9333 710.2062 714.4335 762.2710 767.0399 777.5326 823.5208 828.1318 836.3163 854.0139 858.7359 859.2743 879.3435 903.7251 909.5626 923.3168 938.3124 949.2057 955.4706 966.0571 978.6569 980.7287 986.7950 990.3512 990.8703 1006.9522 1013.8921 1026.7675 1027.6218 1028.1501 1061.4039 1073.6036 1078.6287 1094.5721 1106.3647 1113.6915 1128.8412 1141.3451 1165.0907 1179.3336 1181.8858 1183.3212 1193.3574 1193.6111 1194.3580 1204.8526 1216.2228 1219.0005 1239.5622 1251.7714 1266.1612 1276.2133 1291.4548 1312.0742 1323.9171 1333.4338 1334.6337 1337.0394 1342.2071 1345.1868 1353.1042 1362.7153 1384.2094 1387.3737 1417.8204 1438.7314 1442.6431 1443.7909 1456.4653 1460.8132 1463.4960 1465.7617 1473.6310 1476.6832 1479.1884 1483.2567 1484.5285 1491.0230 1492.1037 1496.2706 1506.1489 1591.4163 1592.4262 1609.7562 1610.6595 2989.2584 2992.0329 2996.0951 3000.2560 3013.6678 3023.8468 3037.2474 3041.0097 3043.2650 3048.2945 3052.1215 3054.2124 3060.7580 3069.4304 3089.7038 3113.1739 3116.4016 3119.3313 3122.5374 3130.9815 3142.4688 3144.9461 3147.3402 3150.0365 3155.8654 3161.7445 3165.1540 3168.3923 3174.0831 3177.9049
redmass: 4.0598 4.2659 3.8518 3.3640 3.9853 2.6129 2.8934 3.4574 3.7477 3.0073 2.7428 3.9665 3.8942 1.9936 1.8245 1.8834 2.5467 1.7566 1.7586 2.2704 2.2696 1.8155 2.4766 2.7211 2.5301 2.1236 2.7225 3.3446 3.0006 3.5848 3.2955 3.9657 2.1075 6.2399 6.2310 3.4182 3.2179 4.0629 2.8080 1.7430 1.8683 1.3210 1.8657 2.0037 2.9767 3.5712 3.0895 1.4082 1.5687 1.3136 2.2815 2.3842 2.1398 1.4983 1.5338 1.8854 2.0158 1.7903 1.8863 1.3871 1.3900 6.0295 6.1267 1.3321 1.3356 2.4272 2.2904 2.2392 1.9862 1.7460 1.4204 1.4648 1.5291 1.6625 3.6246 1.4204 1.3177 1.0951 1.1619 1.0584 1.1961 1.2835 1.2504 1.6263 2.6605 3.0264 1.2870 1.4086 1.3817 1.4349 1.4743 1.2838 1.3707 1.2771 1.3194 1.2984 1.2893 1.3457 1.2749 1.3804 6.3883 6.7382 1.1358 1.1386 2.0727 2.0416 1.0885 1.0868 1.1003 1.0697 1.0914 1.1069 1.1874 1.8460 1.8620 1.1374 1.0752 1.0722 1.0575 5.8821 5.8583 6.0334 6.1090 1.0607 1.0592 1.0608 1.0604 1.0630 1.0657 1.0340 1.0529 1.0785 1.0987 1.0962 1.0897 1.0711 1.1019 1.1013 1.0896 1.0891 1.0905 1.0897 1.1051 1.1025 1.0891 1.1032 1.0895 1.0950 1.0953 1.1035 1.1041 1.1012 1.1013
irintensity: 0.3443 0.1753 0.0558 0.2724 0.1829 0.1568 0.1289 0.3409 0.1727 0.0976 0.7763 0.8998 3.8842 0.9817 1.3798 0.1787 0.1842 0.9214 0.8786 0.0905 1.8247 0.9531 0.3635 0.3665 0.2939 0.7997 1.0165 1.3544 4.6513 14.7573 3.2481 15.7886 0.7160 0.0631 0.0458 9.0215 35.8090 51.7818 14.7454 51.0232 78.2738 9.9545 50.0114 45.9827 3.2232 14.8826 4.4154 1.1712 2.2055 0.4989 10.8292 11.9124 4.3514 2.2774 2.0331 4.2829 7.8954 1.7931 4.7752 0.0259 0.0360 1.8572 4.1086 0.0087 0.0037 2.1388 9.0397 1.9557 8.1079 5.1234 4.0889 6.6904 9.8098 6.1981 1.0916 9.4158 1.1756 0.1013 0.5189 0.0371 3.8899 5.5440 2.0886 0.7700 9.2695 23.5981 3.6355 0.7287 2.4616 2.1000 0.6385 3.9391 8.4663 2.1354 2.2432 0.8693 7.5081 4.2954 10.6134 2.4905 0.0870 0.5526 20.9756 13.4108 11.5145 11.2618 5.6516 9.3397 9.5029 19.3147 5.6623 2.1899 17.7089 11.6778 8.6665 10.1992 22.5117 28.1450 60.5763 2.6045 2.3122 1.7215 3.2941 18.7909 32.7382 23.0023 36.2734 35.3262 26.3053 9.8769 1.3385 21.1777 4.4704 10.2856 7.5923 18.1254 26.0921 38.0853 10.0916 19.0249 5.9359 13.3022 4.3151 1.7685 1.7568 8.2945 1.0243 17.3808 10.3320 4.7399 5.9859 11.7965 8.3235
temp: 298.150 k
press: 1.00000 atm
elementType: 7 6 6 6 6 6 6 6 6 6 6 6 6 6 6 6 6 6 6 6 6 6 6 1 1 1 1 1 1 1 1 1 1 1 1 1 1 1 1 1 1 1 1 1 1 1 1 1 1 1 1 1 1
symmnumber: 1
zpe: 1230401.1 jmol-1
zpe.correction: 0.468635 hartree
zpe.thermalcorrener: 0.490103 hartree
zpe.thermalcorrenthalpy: 0.491047 hartree
zpe.thermalcorrgfe: 0.418328 hartree
zpe.sumelectzpe: -909.117570 hartree
zpe.sumelectthermal: -909.096103 hartree
zpe.sumelectthermalent: -909.095158 hartree
zpe.sumelectthermalfe: -909.167877 hartree
dipole: 3.4798 1.9556 1.4369
dipole: 4.2424
quadrupole: -81.7973 -122.0400 -125.7676
quadrupole: 0.2788 1.4817 0.3845
quadrupole: 28.0710 -12.1717 -15.8993 0.2788 1.4817 0.3845
hfenergy: -909.5862051 hartree
pointgroup: C01 [X(C22H30N1)]
dipole: 1.3907273 -0.63301 -0.6716281 debye
polarizability: 315.4642665|1.1811352|201.1419018|-0.7130565|1.9789179|182.8254512 unknown
InChI: InChI=1S/C22H30N/c1-23(2,19-21-14-8-4-9-15-21)22(16-10-5-11-17-22)18-20-12-6-3-7-13-20/h3-4,6-9,12-15H,5,10-11,16-19H2,1-2H3
charge 1 multiplicity 1
53 atoms
N  1.044736 -0.53482 -0.606809
C  -0.601236 -0.629372 -0.392198
C  -1.21224 -1.602532 -1.449134
C  -0.873187 -1.169588 1.043818
C  -1.1438 0.831288 -0.631083
C  -1.395464 -3.066329 -0.979854
C  -2.248912 -1.881733 1.14663
C  -2.331387 -3.155558 0.259511
C  1.706529 0.179507 0.63597
C  1.391851 0.235687 -1.87674
C  1.672561 -1.915178 -0.749706
C  -2.572843 1.113673 -0.170616
C  3.185473 0.478911 0.501358
C  -3.668499 0.948907 -1.057241
C  -2.824976 1.610723 1.134839
C  4.155386 -0.452829 0.960076
C  3.62508 1.730688 -0.006758
C  -4.987355 1.232808 -0.636819
C  -4.141216 1.896898 1.558314
C  5.533125 -0.154209 0.880775
C  5.001786 2.031376 -0.085634
C  -5.228549 1.699666 0.675623
C  5.958988 1.08615 0.351715
H  -0.663199 -1.559677 -2.409515
H  -2.217942 -1.202637 -1.678138
H  -0.826461 -0.348864 1.781437
H  -0.102695 -1.910478 1.333756
H  -1.08706 1.040357 -1.714999
H  -0.486953 1.561116 -0.123298
H  -0.422291 -3.532956 -0.746458
H  -1.81769 -3.654287 -1.815248
H  -3.046985 -1.173194 0.873219
H  -2.421572 -2.144656 2.205937
H  1.519589 -0.491799 1.486795
H  1.134232 1.106824 0.786448
H  -3.377132 -3.295464 -0.068777
H  -2.067538 -4.053082 0.848488
H  2.473648 0.150815 -2.053459
H  0.843329 -0.196386 -2.725789
H  1.131557 1.295228 -1.763461
H  2.763402 -1.790439 -0.817829
H  1.428979 -2.534099 0.124066
H  1.300329 -2.392551 -1.665301
H  -3.493677 0.622363 -2.090443
H  -1.988945 1.791134 1.822592
H  3.835812 -1.403365 1.405805
H  2.891816 2.483665 -0.32258
H  -5.821386 1.104929 -1.334726
H  -4.318018 2.283222 2.567589
H  6.270208 -0.87765 1.243541
H  5.327304 3.002225 -0.472538
H  -6.249246 1.926025 1.000605
H  7.026734 1.321444 0.297043
