program: Gaussian 09
title: 000029447
version: EM64L-G09RevD.01
frameworkgroup: C1[X(C13H15ClN2)]
method: RPBEPBE
basis: SDD
operation: Freq
keyword: #p
keyword: freq=noraman
keyword: PBEPBE/SDD
title: #p freq=noraman PBEPBE/SDD
converged: YES YES NO NO
title: Mulliken charges:
elementType: Cl N N C C C C C C C C C C C C C H H H H H H H H H H H H H H H
charge: -0.089398 -0.130857 -0.411074 -0.148566 -0.470807 -0.437308 -0.375824 0.368963 0.101687 -0.648240 -0.418379 0.248758 -0.400011 -0.336200 -0.111213 -0.216502 0.203750 0.233496 0.214536 0.209614 0.224189 0.173080 0.227076 0.222709 0.189274 0.241443 0.289543 0.305453 0.258186 0.232552 0.250070
chargesum: 0.00000
title: Mulliken charges with hydrogens summed into heavy atoms:
elementType: Cl N N C C C C C C C C C C C C C
charge: -0.089398 -0.130857 -0.105621 0.055183 -0.022775 -0.003504 0.024332 0.368963 0.101687 0.005186 -0.128836 0.248758 -0.141825 -0.103648 -0.111213 0.033569
polarizability: 2.20432152e+02 1.09422059e+01 1.64576621e+02 -9.72719695e-01 -5.78516398e+00 9.87725508e+01
1716.lowfreq: -0.0019 -0.0011 0.0015 3.5412 4.7895 8.9266 31.6137 35.9879 75.3187
frequency: 30.9880 35.9154 75.3122 98.8378 122.8158 176.0871 184.1453 218.4185 237.9512 252.2523 297.1084 312.5099 347.7198 360.6336 410.9612 420.7549 488.9734 510.1156 558.1745 579.1903 589.3193 618.3978 645.8366 661.3408 709.5480 752.9953 778.3943 792.9012 819.5988 835.4208 862.9591 872.0177 873.7710 892.5049 926.9176 928.0562 956.6322 1033.1476 1043.6730 1050.9842 1069.2891 1082.8346 1084.6761 1109.1395 1136.5221 1138.9360 1179.3570 1194.7504 1222.5100 1229.2311 1232.6016 1243.8366 1270.5171 1279.1358 1289.6935 1292.9352 1310.3783 1333.6866 1350.1497 1396.5991 1418.8350 1430.3353 1455.6732 1462.2265 1463.9848 1468.7238 1478.1565 1478.6112 1489.0257 1558.7678 1575.5722 1627.7791 2815.3377 2839.0131 2859.4800 3011.3050 3019.6205 3022.6719 3035.8362 3070.3539 3079.9002 3092.0835 3140.5197 3163.0628 3175.5888 3237.8203 3613.4381
redmass: 2.6654 3.3119 4.5167 4.0782 6.0025 2.1982 3.1183 2.7342 1.3279 4.0939 4.7941 2.9220 13.0672 3.4939 4.4842 2.9651 3.6352 1.2848 3.0392 2.9250 6.8484 2.8603 3.9128 3.9479 3.4500 3.2633 3.7927 1.5676 2.3394 1.4109 2.4018 1.5590 4.5833 2.1175 2.3320 1.3794 2.0404 2.4859 2.0952 2.0818 2.2653 2.2642 1.5287 1.2672 1.3430 1.3775 1.7333 2.0949 1.7479 1.6479 1.8927 1.6842 1.7894 1.3202 2.1333 1.3916 1.4401 1.5080 1.7724 4.7555 1.9543 1.2172 4.4149 4.8038 1.0822 1.0578 1.0588 1.0773 1.1027 6.7887 6.7241 7.1941 1.0801 1.0704 1.0580 1.0598 1.0678 1.0725 1.0840 1.1031 1.1008 1.1052 1.0898 1.0926 1.0956 1.0983 1.0809
irintensity: 0.4713 0.5984 1.2216 0.5156 3.1459 0.8783 1.2317 0.7698 1.4983 0.8796 2.5961 3.7611 5.1691 2.6991 2.9288 9.4193 10.9482 85.9663 3.0010 24.1501 5.4818 0.1593 6.3639 20.7334 7.7745 5.8360 7.1898 57.2573 3.0031 18.2654 6.6769 21.9837 45.1284 9.9036 3.5168 1.3374 2.9516 7.6526 28.2966 12.5739 9.2193 20.3165 37.0842 7.6425 2.4982 5.4498 7.4747 29.7286 14.9674 4.5458 19.9703 0.3627 15.9533 15.0448 2.2921 4.3714 1.9845 0.4786 4.8129 53.4507 18.6092 8.5819 7.0688 62.1586 4.6909 16.7741 4.8932 7.2015 3.1417 3.8005 18.6547 6.0949 44.3769 79.6613 188.6697 21.3565 42.8250 41.7385 63.6828 7.7282 33.2590 53.4658 10.0653 2.1681 5.2467 0.1015 62.8947
temp: 298.150 k
press: 1.00000 atm
elementType: 17 7 7 6 6 6 6 6 6 6 6 6 6 6 6 6 1 1 1 1 1 1 1 1 1 1 1 1 1 1 1
symmnumber: 1
zpe: 663292.1 jmol-1
zpe.correction: 0.252635 hartree
zpe.thermalcorrener: 0.267012 hartree
zpe.thermalcorrenthalpy: 0.267957 hartree
zpe.thermalcorrgfe: 0.210095 hartree
zpe.sumelectzpe: -1072.772519 hartree
zpe.sumelectthermal: -1072.758141 hartree
zpe.sumelectthermalent: -1072.757197 hartree
zpe.sumelectthermalfe: -1072.815059 hartree
dipole: 2.6603 2.9640 -0.3311
dipole: 3.9965
quadrupole: -103.9772 -87.9268 -104.3307
quadrupole: -10.1064 2.1572 -1.9149
quadrupole: -5.2323 10.8181 -5.5858 -10.1064 2.1572 -1.9149
hfenergy: -1073.0251538 hartree
pointgroup: C01 [X(C13H15Cl1N2)]
dipole: 0.8716114 1.1329455 0.6549798 debye
polarizability: 215.2954489|10.9568893|152.6871252|18.1196866|29.7364691|115.7987504 unknown
InChI: InChI=1S/C13H15ClN2/c1-16-6-2-3-13(16)11-8-15-12-5-4-9(14)7-10(11)12/h4-5,7-8,13,15H,2-3,6H2,1H3
charge 0 multiplicity 1
31 atoms
Cl -3.897448 -2.316637 -1.513336
N  2.839036 -0.249156 0.790429
N  -0.741767 2.170381 0.869239
C  1.670851 -0.534853 -0.095491
C  2.245499 -0.382191 -1.552759
C  3.786602 -0.218273 -1.376138
C  4.043303 -0.713318 0.062076
C  0.495993 0.361478 0.212459
C  -0.901768 0.098108 -0.076402
C  2.70758 -0.769141 2.161006
C  0.551934 1.631968 0.784761
C  -1.658108 1.251441 0.347016
C  -1.58677 -1.006166 -0.653368
C  -3.061291 1.32537 0.211511
C  -2.979214 -0.910967 -0.776338
C  -3.7278 0.222467 -0.360312
H  1.339819 -1.599186 0.034894
H  1.798848 0.48822 -2.060633
H  2.001341 -1.277939 -2.150817
H  4.364316 -0.787389 -2.125083
H  4.070661 0.845203 -1.458159
H  4.138266 -1.830628 0.07827
H  4.958087 -0.289347 0.514512
H  3.580333 -0.461424 2.76467
H  2.635133 -1.886145 2.19865
H  1.799917 -0.353294 2.631888
H  1.427781 2.171429 1.137647
H  -0.975946 3.078981 1.262145
H  -1.052897 -1.898622 -0.992129
H  -3.629707 2.204153 0.534421
H  -4.813886 0.232976 -0.48643
