program: Gaussian 09
title: 000029454
version: EM64L-G09RevD.01
frameworkgroup: C1[X(C14H18N2)]
method: RPBEPBE
basis: SDD
operation: Freq
keyword: #pfreq=noraman
keyword: PBEPBE/SDD
title: #p freq=noraman PBEPBE/SDD
converged: YES YES NO NO
title: Mulliken charges:
elementType: N N C C C C C C C C C C C C C C H H H H H H H H H H H H H H H H H H
charge: -0.130863 -0.417625 -0.143774 -0.476833 -0.430490 -0.381231 0.368614 0.107549 -0.648377 -0.439492 0.087350 -0.442378 0.379551 -0.242270 -0.431466 -0.827841 0.199753 0.234673 0.211095 0.204436 0.223663 0.170010 0.225896 0.221017 0.185672 0.244570 0.285886 0.309216 0.230400 0.216410 0.222544 0.222930 0.225608 0.235796
chargesum: 0.00000
title: Mulliken charges with hydrogens summed into heavy atoms:
elementType: N N C C C C C C C C C C C C C C
charge: -0.130863 -0.108409 0.055979 -0.031065 -0.002390 0.014675 0.368614 0.107549 0.002882 -0.153606 0.087350 -0.211977 0.379551 -0.025860 -0.208922 -0.143507
polarizability: 2.16645429e+02 7.48869659e+00 1.62367127e+02 2.19603989e+00 1.16888631e+01 1.08385192e+02
1716.lowfreq: -20.3195 -9.7902 -0.0006 -0.0006 -0.0003 5.1272 8.1490 35.2288 66.8633
frequency: -18.0828 34.9144 66.8366 103.4040 106.8534 158.0867 171.0806 207.3070 220.5100 227.7974 247.3476 255.0712 313.8718 355.6935 408.3110 479.8128 489.2087 508.6502 512.7871 556.7397 578.2950 611.1574 617.4861 653.1334 659.3307 718.2092 749.6974 788.1935 804.7687 827.5196 843.2231 866.2177 885.3363 888.3128 922.6007 936.8597 958.0916 962.2478 1002.8200 1039.1129 1042.6323 1046.9141 1066.5974 1077.7289 1088.3381 1107.2751 1125.1566 1141.2430 1175.2367 1182.4864 1196.2021 1218.1320 1234.1808 1235.7161 1259.7336 1270.9291 1287.5216 1290.5010 1304.2531 1309.1640 1337.0714 1361.2711 1391.2236 1400.3735 1402.8561 1427.1572 1447.7852 1463.1742 1467.0565 1470.5729 1476.7213 1478.3378 1478.8627 1490.1930 1494.9701 1561.6672 1599.3320 1625.7980 2805.4740 2833.0440 2856.0997 2958.6473 3010.9884 3021.4494 3023.7576 3028.1238 3034.7779 3068.1400 3082.7419 3084.5359 3092.2037 3117.6036 3130.7846 3153.8277 3233.9042 3614.7897
redmass: 2.2833 3.4908 3.3192 2.0272 1.3196 2.6701 2.3229 3.7059 3.6759 1.2287 2.7271 2.7730 2.7429 3.5679 3.9793 2.2081 2.7716 2.8599 2.4332 3.2639 2.9481 5.7018 3.0858 3.2520 4.3046 2.4432 1.7924 2.2541 2.2587 1.4558 3.4011 2.9247 1.4214 1.9260 2.6075 2.3221 1.4053 1.8513 2.2244 2.2247 1.5099 2.1164 1.9267 1.7016 1.7396 1.2701 1.9524 1.5230 1.2749 1.7692 2.0466 1.6721 2.4442 1.5881 1.7280 1.2751 1.7077 1.5240 1.7606 1.5354 1.5016 1.9803 1.6092 2.8199 1.9978 1.2004 3.2489 1.0796 1.0561 1.0456 1.0535 1.3870 1.0853 1.1339 2.4215 6.6954 6.5979 6.9229 1.0800 1.0708 1.0579 1.0386 1.0599 1.0686 1.0722 1.0977 1.0818 1.1042 1.1005 1.0961 1.1051 1.0859 1.0908 1.0988 1.0982 1.0806
irintensity: 0.5289 0.3286 1.3446 0.5309 0.5440 0.2871 0.7746 2.6676 2.1295 1.0269 3.7226 5.4118 4.4076 2.9403 1.3830 35.7837 25.7743 19.1159 18.1847 1.9507 6.9463 4.6085 0.8520 1.5934 2.2877 1.9696 38.5773 33.8997 5.7712 20.6327 3.5895 11.8217 2.4939 20.4279 4.9805 2.9283 0.3636 1.8483 0.1581 9.2994 6.9035 39.3429 27.1426 4.2790 9.6008 5.7465 15.4980 9.0324 4.7672 5.6080 26.3664 13.2685 6.0247 1.3120 0.8882 6.4035 1.9275 5.3738 18.9874 9.4167 1.3999 28.5000 17.9386 30.8016 9.7262 8.2518 13.0144 4.2341 15.2786 14.3000 6.5130 13.2786 8.4219 1.3834 4.2467 3.3301 4.0046 2.1824 44.0485 88.7185 187.8321 49.4400 22.9459 48.2734 46.4368 27.3412 63.4629 5.2556 32.0365 18.4400 53.7596 4.6162 25.6969 32.8743 0.0099 49.6773
temp: 298.150 k
press: 1.00000 atm
elementType: 7 7 6 6 6 6 6 6 6 6 6 6 6 6 6 6 1 1 1 1 1 1 1 1 1 1 1 1 1 1 1 1 1 1
symmnumber: 1
zpe: 759163.1 jmol-1
zpe.correction: 0.289150 hartree
zpe.thermalcorrener: 0.303201 hartree
zpe.thermalcorrenthalpy: 0.304145 hartree
zpe.thermalcorrgfe: 0.248256 hartree
zpe.sumelectzpe: -652.611157 hartree
zpe.sumelectthermal: -652.597105 hartree
zpe.sumelectthermalent: -652.596161 hartree
zpe.sumelectthermalfe: -652.652051 hartree
dipole: 0.0075 -1.5758 -0.2928
dipole: 1.6027
quadrupole: -86.8615 -86.7308 -98.7596
quadrupole: -6.6158 -2.2914 2.9764
quadrupole: 3.9224 4.0532 -7.9756 -6.6158 -2.2914 2.9764
hfenergy: -652.9003066 hartree
pointgroup: C01 [X(C14H18N2)]
dipole: 0.0020584 0.5199081 0.3568029 debye
polarizability: 216.6562575|4.0736352|146.7607862|7.1279002|26.9820388|123.9807044 unknown
InChI: InChI=1S/C14H18N2/c1-10-5-3-6-11-12(9-15-14(10)11)13-7-4-8-16(13)2/h3,5-6,9,13,15H,4,7-8H2,1-2H3
charge 0 multiplicity 1
34 atoms
N  2.855868 0.00253 0.839374
N  -1.180521 1.586509 0.839749
C  1.828335 -0.410161 -0.16397
C  2.444137 0.045713 -1.535837
C  3.948689 0.343433 -1.239394
C  4.168197 -0.212329 0.185386
C  0.46701 0.166299 0.136527
C  -0.819438 -0.38867 -0.249157
C  2.717454 -0.644305 2.154524
C  0.206049 1.367433 0.795234
C  -1.836707 0.52274 0.206246
C  -1.215034 -1.569182 -0.935569
C  -3.224424 0.306333 0.009242
C  -2.587718 -1.801952 -1.138661
C  -3.572658 -0.879171 -0.673721
C  -4.259381 1.298228 0.506447
H  1.738489 -1.529424 -0.180864
H  1.922349 0.942879 -1.907128
H  2.320097 -0.748545 -2.292708
H  4.628999 -0.122383 -1.973739
H  4.130887 1.431836 -1.249093
H  4.435148 -1.30111 0.139781
H  4.970181 0.30851 0.739315
H  3.474513 -0.242845 2.852125
H  2.842407 -1.756653 2.107873
H  1.717263 -0.430999 2.569003
H  0.915966 2.065179 1.233772
H  -1.636538 2.378185 1.286648
H  -0.468246 -2.283308 -1.300484
H  -2.915003 -2.706363 -1.66406
H  -4.633462 -1.094463 -0.851717
H  -4.199337 1.438728 1.604316
H  -4.130132 2.294267 0.037881
H  -5.280839 0.95366 0.27346
