program: Gaussian 09
title: 000029518
version: EM64L-G09RevD.01
frameworkgroup: C1[X(C20H34N2)]
method: RPBEPBE
basis: SDD
operation: Freq
keyword: #pfreq=noraman
keyword: PBEPBE/SDD
title: #p freq=noraman PBEPBE/SDD
converged: YES YES NO NO
title: Mulliken charges:
elementType: N N C C C C C C C C C C C C C C C C C C C C H H H H H H H H H H H H H H H H H H H H H H H H H H H H H H H H H H
charge: -0.592832 -0.297986 -0.135863 0.455669 -0.174269 -0.087018 0.271941 -0.536245 -0.542439 -0.223707 -0.537294 -0.471215 -0.494888 0.513194 -0.513134 -0.857043 -0.492883 -0.836259 -0.677494 -0.467928 -0.061011 -0.642100 0.197738 0.242478 0.192231 0.196743 0.196557 0.224758 0.212759 0.225710 0.209491 0.224998 0.207098 0.223371 0.218237 0.211105 0.204104 0.210763 0.233148 0.227505 0.211215 0.206907 0.221762 0.225522 0.222033 0.226306 0.193804 0.187707 0.226317 0.213034 0.264553 0.262313 0.242109 0.221705 0.193087 0.223633
chargesum: 0.00000
title: Mulliken charges with hydrogens summed into heavy atoms:
elementType: N N C C C C C C C C C C C C C C C C C C C C
charge: -0.065965 -0.055876 0.061875 0.455669 0.068209 0.105213 0.271941 -0.142945 -0.104922 0.002003 -0.102805 -0.040746 -0.065546 0.513194 -0.098266 -0.185174 -0.285976 -0.166942 -0.257385 -0.053904 0.152023 -0.003675
polarizability: 2.79233304e+02 -4.44126640e+00 2.10076757e+02 1.64506805e+00 -1.58901733e+00 1.70970627e+02
1716.lowfreq: -14.9341 -9.7137 -1.5036 -0.0007 -0.0005 -0.0005 29.8398 47.5572 70.9276
frequency: 29.2410 46.9283 70.8143 88.6536 102.8706 114.4560 129.2965 164.4811 173.5221 187.1282 201.5180 207.4095 218.1085 229.2425 249.3116 251.0230 260.3432 275.9519 284.5053 298.7473 309.3242 312.2535 356.9342 375.8682 392.6425 397.6993 414.5195 440.9511 447.9400 462.2868 466.9218 489.3149 514.4808 534.3798 548.4024 578.0079 586.9082 616.1028 620.6242 639.1373 686.4154 711.0845 731.4628 793.6559 808.2176 819.4344 827.8991 835.3176 836.3969 876.3495 881.4790 905.6192 915.5871 927.0240 943.5973 958.0128 977.3404 984.6010 989.9770 997.7707 1006.3284 1014.6210 1018.5182 1026.6988 1032.8691 1065.7538 1073.4695 1078.1958 1097.1652 1102.8499 1111.4867 1116.1897 1118.4387 1131.9765 1135.6644 1137.4454 1142.4285 1157.3177 1159.0342 1170.2883 1185.6914 1189.7989 1196.5056 1208.0723 1219.8022 1231.1387 1244.3433 1246.2314 1248.3531 1259.5471 1269.9641 1275.9765 1279.2992 1285.7654 1290.9420 1300.6604 1309.2235 1320.0522 1322.1574 1325.5786 1330.3743 1336.4292 1342.4865 1348.6246 1351.0464 1356.8654 1366.3683 1375.2758 1383.7720 1386.5760 1430.8977 1449.3839 1455.8359 1456.5120 1457.6256 1461.2992 1463.1687 1467.1890 1469.4344 1473.3121 1475.7712 1480.9285 1487.9151 1490.0471 1495.8265 1496.6518 1632.9037 1678.2633 2883.6419 2899.6665 2919.9335 2924.6594 2933.7896 2944.1381 2957.6768 2958.9454 2961.5694 2964.9187 2974.2126 2977.2529 2981.1300 2981.9944 2986.9614 2995.1592 2999.7111 3003.3740 3009.7271 3028.2781 3029.5210 3041.9980 3043.2952 3044.7354 3059.4986 3067.2657 3070.8777 3071.6590 3078.4518 3079.4305 3083.5338 3436.2089 3454.3928 3586.3708
redmass: 3.8626 3.0248 3.4986 2.2906 3.0862 2.5485 1.7431 2.1851 1.4258 1.5368 1.3664 3.3201 2.0410 2.9667 2.0799 1.9461 1.1202 2.2550 2.2476 2.4543 2.4787 2.5124 2.2338 2.5153 3.5337 2.5381 3.2932 2.9870 2.3972 2.8292 3.0732 2.3264 1.5971 2.5853 3.3282 2.8059 3.3794 2.7404 2.4016 1.6259 2.8486 2.6261 2.6445 1.7111 1.8378 1.6995 1.6215 1.8328 2.5071 1.8237 1.8366 2.0101 1.8839 1.7977 1.7074 1.8398 2.0645 2.0831 2.0975 2.1934 2.0090 1.8382 2.0927 1.8122 1.7008 2.1428 1.9153 2.1178 2.4530 1.8584 2.1430 1.7038 1.6566 2.2022 1.5064 1.8441 1.5079 2.6813 2.2984 2.1949 2.2983 2.4422 1.5911 1.6949 1.5801 1.4518 1.4639 1.4026 1.4951 1.4017 1.5852 1.3980 1.4398 1.3728 1.3373 1.4947 1.3572 1.5073 1.3141 1.3785 1.5428 1.3935 1.4073 1.5598 1.4763 1.5000 1.4739 1.3150 1.2397 1.2467 1.1316 1.1782 1.0897 1.1096 1.0768 1.0855 1.0813 1.0771 1.0790 1.0883 1.0762 1.0643 1.0759 1.0544 1.0614 1.0433 1.0995 7.7181 1.0545 1.0800 1.0807 1.0669 1.0669 1.0600 1.0841 1.0703 1.0630 1.0807 1.0760 1.0382 1.0390 1.0623 1.0659 1.0897 1.0726 1.0888 1.0758 1.0968 1.0935 1.1001 1.0980 1.0996 1.0976 1.0999 1.1007 1.0990 1.0958 1.0912 1.0958 1.0740 1.0442 1.0981
irintensity: 0.0166 0.3027 0.2568 1.7170 0.6350 0.5903 1.5892 1.6766 0.1365 0.7938 0.4343 0.1796 0.9682 0.8428 1.3872 0.9545 43.6682 1.5734 2.2110 4.2058 1.5018 2.9093 3.3020 2.5287 4.1299 2.1369 2.0512 19.2495 8.0594 20.3288 4.4205 13.8402 206.1235 10.7966 27.7775 42.9878 6.8845 52.3975 18.3696 104.2010 4.3648 4.8390 0.4189 5.6594 11.0887 12.0635 1.4989 7.7685 0.8451 0.5771 0.2339 3.6400 4.6448 1.9888 9.4921 16.7290 1.0454 8.9639 5.5663 1.5375 1.0958 12.2875 30.6592 3.3033 6.3122 5.5695 5.7148 1.7513 11.8013 15.3193 1.7426 0.2528 10.7313 3.5994 2.6464 9.0752 6.2334 40.2257 21.8515 2.4414 1.2225 3.6839 4.9397 1.9508 1.1869 0.6211 2.2594 0.5550 4.9286 0.5421 1.9472 5.8720 4.8479 2.4084 0.5092 0.0895 2.4539 1.1302 2.1050 2.3560 1.8450 0.5285 0.1433 2.4400 0.8403 1.6091 15.2585 9.0110 2.6977 33.5765 5.3548 17.6942 8.1498 9.7268 1.6454 5.1434 7.1179 9.1750 9.4303 0.1432 3.8096 22.7702 9.1989 1.8661 8.6406 21.2826 37.4931 2.9017 112.2383 11.3409 10.8048 42.1040 30.6693 43.5545 30.3084 15.2153 14.0388 39.6013 45.7101 31.6110 30.0821 29.0632 20.4718 24.3811 83.3320 46.1969 59.5643 72.9184 22.3657 9.9727 38.0598 66.7297 35.5874 43.4840 66.4337 32.3752 23.5782 79.5874 25.9231 1.4337 0.8521 0.2562
temp: 298.150 k
press: 1.00000 atm
elementType: 7 7 6 6 6 6 6 6 6 6 6 6 6 6 6 6 6 6 6 6 6 6 1 1 1 1 1 1 1 1 1 1 1 1 1 1 1 1 1 1 1 1 1 1 1 1 1 1 1 1 1 1 1 1 1 1
symmnumber: 1
zpe: 1324482.0 jmol-1
zpe.correction: 0.504469 hartree
zpe.thermalcorrener: 0.526732 hartree
zpe.thermalcorrenthalpy: 0.527676 hartree
zpe.thermalcorrgfe: 0.455550 hartree
zpe.sumelectzpe: -890.264264 hartree
zpe.sumelectthermal: -890.242001 hartree
zpe.sumelectthermalent: -890.241057 hartree
zpe.sumelectthermalfe: -890.313183 hartree
dipole: 0.4334 -0.2952 1.1899
dipole: 1.3003
quadrupole: -147.3442 -134.2972 -136.4854
quadrupole: 7.9922 -0.0382 -1.7556
quadrupole: -7.9686 5.0784 2.8902 7.9922 -0.0382 -1.7556
hfenergy: -890.7687329 hartree
pointgroup: C01 [X(C20H34N2)]
dipole: 0.1740756 -0.1034088 0.4698143 debye
polarizability: 279.3306392|-3.7168678|209.8991677|1.1996996|-2.4667715|171.0508803 unknown
InChI: InChI=1S/C20H34N2/c1-19-10-8-14(22-3)12-13(19)4-5-15-16-6-7-18(21)20(16,2)11-9-17(15)19/h4,14-18,22H,5-12,21H2,1-3H3
charge 0 multiplicity 1
56 atoms
N  -5.727686 -0.933858 -0.370829
N  5.737965 -0.221179 -0.196685
C  -2.35594 0.789154 -0.280355
C  -3.160775 -0.507917 0.013055
C  -0.917946 0.784184 0.275235
C  -0.144586 -0.459012 -0.273589
C  1.311894 -0.567272 0.323545
C  -2.414979 -1.682859 -0.657476
C  -0.955544 -1.783016 -0.137916
C  -4.538869 -0.119784 -0.650063
C  -3.323273 1.935859 0.12128
C  -4.745017 1.37037 -0.213846
C  -0.169217 2.07833 -0.119337
C  2.004138 0.81157 0.294539
C  2.145297 -1.550671 -0.571135
C  -3.368326 -0.776163 1.525085
C  1.32686 1.972961 0.077718
C  1.28978 -1.089785 1.794489
C  3.511754 0.827132 0.518858
C  3.662153 -1.564761 -0.280032
C  4.277415 -0.158151 -0.423111
C  6.510111 0.996558 -0.505912
H  -2.254521 0.8325 -1.391526
H  -0.95296 0.732599 1.383746
H  -0.016692 -0.269878 -1.365205
H  -2.406921 -1.523252 -1.757102
H  -2.935618 -2.645947 -0.474571
H  -0.980756 -2.099099 0.921446
H  -0.434184 -2.590104 -0.687727
H  -4.38036 -0.149491 -1.749134
H  -3.107855 2.871677 -0.424408
H  -3.229025 2.163971 1.200672
H  -5.410448 1.408803 0.670131
H  -5.251108 1.940856 -1.011472
H  -0.56228 2.935249 0.464583
H  -0.389195 2.319492 -1.184212
H  1.996419 -1.263214 -1.633165
H  1.742836 -2.575686 -0.458286
H  -2.413115 -0.892549 2.064415
H  -3.924885 0.042858 2.016893
H  -3.946009 -1.709098 1.669246
H  1.896481 2.914674 0.046165
H  2.282786 -1.004994 2.268775
H  0.581879 -0.506777 2.411144
H  0.994974 -2.154204 1.839549
H  3.892439 1.857585 0.388659
H  3.751166 0.5278 1.563106
H  3.854427 -1.942532 0.746538
H  4.177471 -2.254161 -0.974399
H  4.127393 0.181917 -1.469739
H  -6.052004 -0.895663 0.60022
H  -5.702086 -1.888295 -0.741003
H  5.956936 -0.598519 0.735775
H  7.588505 0.789726 -0.380149
H  6.261434 1.893141 0.111353
H  6.346868 1.268525 -1.565538
