program: Gaussian 09
title: 000029426
version: EM64L-G09RevD.01
frameworkgroup: C1[X(C4H5ClI2O)]
method: RPBEPBE
basis: SDD
operation: Freq
keyword: #p
keyword: freq=noraman
keyword: PBEPBE/SDD
title: #p freq=noraman PBEPBE/SDD
converged: YES YES NO NO
title: Mulliken charges:
elementType: I I Cl O C C C C H H H H H
charge: 0.110899 0.141115 -0.019590 -0.404647 -0.135721 -0.360900 -0.095572 -0.646470 0.242166 0.234503 0.285617 0.299146 0.349453
chargesum: 0.00000
title: Mulliken charges with hydrogens summed into heavy atoms:
elementType: I I Cl O C C C C
charge: 0.110899 0.141115 -0.019590 -0.055193 -0.135721 0.115769 -0.095572 -0.061707
polarizability: 1.68297004e+02 4.17208166e+00 9.78621948e+01 -1.37273768e+00 -1.59459790e+00 5.43264748e+01
1716.lowfreq: -9.1104 -2.9904 0.0008 0.0015 0.0015 6.6056 32.8783 46.3573 54.6982
frequency: 32.8639 46.3473 54.6595 111.1527 146.8588 154.1958 220.1626 287.1038 326.5281 356.4672 384.8696 512.9623 547.3997 591.3950 660.6790 884.9918 942.8747 964.5657 1028.8060 1072.8832 1162.8627 1184.1541 1252.1254 1308.7221 1368.9812 1439.4960 1444.9385 1618.9353 2970.9757 3064.9106 3093.5866 3151.3470 3519.9753
redmass: 18.2133 8.3521 5.7497 20.0142 34.0504 9.3263 3.2420 2.3850 2.4102 1.4553 7.9172 3.9337 7.0167 5.5926 7.5857 1.8668 3.1776 2.0343 2.8164 4.3322 1.1650 1.2120 1.1431 1.2119 1.1594 1.0990 1.0807 9.4540 1.0671 1.0575 1.0944 1.1095 1.0660
irintensity: 0.4407 0.8374 2.2245 0.5989 0.1164 0.3118 0.9045 22.8472 59.4663 129.1037 3.8557 69.7268 13.2009 37.2442 32.3783 11.0995 96.6510 30.7364 10.9673 72.3906 13.1992 40.8126 14.2025 19.0699 18.6456 19.3418 10.9461 3.6123 43.5255 8.4268 2.1708 1.0181 7.5841
temp: 298.150 k
press: 1.00000 atm
elementType: 53 53 17 8 6 6 6 6 1 1 1 1 1
symmnumber: 1
zpe: 214782.2 jmol-1
zpe.correction: 0.081806 hartree
zpe.thermalcorrener: 0.092201 hartree
zpe.thermalcorrenthalpy: 0.093145 hartree
zpe.thermalcorrgfe: 0.040861 hartree
zpe.sumelectzpe: -713.053213 hartree
zpe.sumelectthermal: -713.042818 hartree
zpe.sumelectthermalent: -713.041874 hartree
zpe.sumelectthermalfe: -713.094158 hartree
dipole: 1.2992 -0.6696 -2.9032
dipole: 3.2504
quadrupole: -75.9246 -87.4883 -87.0603
quadrupole: 0.1345 2.3587 -0.5380
quadrupole: 7.5664 -3.9972 -3.5692 0.1345 2.3587 -0.5380
hfenergy: -713.1350189 hartree
pointgroup: C01 [X(C4H5Cl1I2O1)]
dipole: 0.3266154 0.5127614 -1.1250543 debye
dipolederiv: -0.0879707 -0.0919219 -0.0320794 -0.0940437 -0.5964513 -0.0446687 -0.0212701 -0.044013 0.0127757 -0.026888 -0.0771073 -0.0108366 -0.1003767 -0.5128487 -0.0478879 -0.0167804 -0.056857 0.0518084 -0.4627609 0.0065384 0.1262135 0.0841961 -0.1199386 -0.0101347 0.381601 -0.0114928 -0.3727562 -0.8388262 0.0599828 -0.0735131 0.1362856 -0.1311574 -0.0698077 -0.1911746 -0.0319399 -0.6170824 -0.0334701 0.1893127 -0.0099845 0.3149143 0.8120741 0.0405345 0.1215385 0.10886 -0.2600171 0.5479487 -0.1189185 0.0937748 -0.1516793 -0.1416431 0.0100615 0.0912202 -0.0517891 0.6013409 -0.2535347 0.182867 0.0543519 0.1571406 0.7745988 0.1526226 -0.1118964 0.0139003 -0.2557389 0.5783544 -0.0598769 -0.2725063 -0.1718326 -0.1865273 -0.0221724 -0.3803784 0.03842 0.5791022 0.1015467 0.0303726 -0.0390319 -0.0039794 -0.0586257 -0.0490323 -0.0313348 0.0016168 0.0760508 -0.0663435 -0.0477019 0.0708403 -0.0514084 0.0708247 0.1009343 0.0313477 0.0358427 -0.1095236 0.073835 0.0013786 0.0940228 0.0221374 -0.0549061 0.0319323 0.0803659 0.0143778 0.0296175 -0.0027312 -0.034198 -0.0016436 -0.0582054 0.0970676 -0.0635594 0.0100821 -0.0370874 -0.0393865 0.4708406 -0.0407276 0.0003922 -0.0831484 0.0475332 -0.0288221 0.0366793 0.0201617 0.3038091 unknown
polarizability: 108.1615226|25.9293344|156.5971078|-1.7392064|10.4436684|55.7270429 unknown
InChI: InChI=1S/C4H5ClI2O/c5-1-3(6)4(7)2-8/h8H,1-2H2
charge 0 multiplicity 1
13 atoms
I  0.970955 2.280456 -0.126303
I  -0.868794 -2.532525 -0.584426
Cl -2.738372 0.372202 1.167534
O  2.683417 -0.536492 0.99571
C  0.686113 0.119688 -0.343173
C  2.020691 -0.605856 -0.306977
C  -0.572354 -0.38068 -0.464405
C  -1.859519 0.380117 -0.520456
H  1.856066 -1.681017 -0.479453
H  2.672706 -0.2058 -1.111237
H  -1.69705 1.443339 -0.749346
H  -2.585416 -0.068335 -1.211311
H  2.903857 0.410202 1.201843
