program: Gaussian 09
title: 000029479
version: EM64L-G09RevD.01
frameworkgroup: C1[X(C14H19Cl2NO2)]
method: RPBEPBE
basis: SDD
operation: Freq
keyword: #p
keyword: freq=noraman
keyword: PBEPBE/SDD
title: #p freq=noraman PBEPBE/SDD
converged: YES YES NO NO
title: Mulliken charges:
elementType: Cl Cl O O N C C C C C C C C C C C C C C H H H H H H H H H H H H H H H H H H H
charge: -0.070536 -0.071246 -0.443799 -0.247476 -0.270027 0.244037 0.437050 -0.539779 -0.343608 -0.337201 -0.367338 -0.454141 -0.384760 0.273000 -0.390960 -0.577165 -0.574354 -0.685786 0.096514 0.229220 0.212033 0.241821 0.226623 0.227310 0.236758 0.209519 0.213255 0.286688 0.244492 0.274059 0.276368 0.256577 0.257261 0.275216 0.214527 0.211738 0.226870 0.387238
chargesum: 0.00000
title: Mulliken charges with hydrogens summed into heavy atoms:
elementType: Cl Cl O O N C C C C C C C C C C C C C C
charge: -0.070536 -0.071246 -0.056561 -0.247476 -0.270027 0.244037 0.437050 -0.098525 0.124836 0.126866 0.055436 -0.167453 -0.140268 0.273000 -0.116901 -0.044219 -0.041877 -0.032649 0.096514
polarizability: 2.16992241e+02 1.08725893e+01 1.94307317e+02 -5.75701759e+00 -1.24610545e+01 1.64842645e+02
1716.lowfreq: -9.2488 -3.9053 -0.0016 -0.0002 0.0022 3.3364 11.5866 25.1944 29.4486
frequency: 10.3958 24.9933 29.3953 32.0317 47.3628 53.9928 59.0100 70.0774 78.5438 85.5814 140.3828 152.2341 162.4986 192.3957 201.5505 208.8218 228.7619 234.1341 264.8464 304.1601 324.9561 351.0989 393.7476 400.1857 421.6802 493.1002 538.2830 558.3201 561.0794 594.7253 619.2209 659.7730 661.0805 697.6444 733.0610 737.4896 744.0500 765.9548 775.3625 788.9748 851.0457 863.7827 870.4121 895.6408 946.9931 965.3829 994.0153 995.0886 1014.5669 1035.8371 1039.5754 1044.3686 1050.7475 1059.6905 1090.0024 1112.7474 1117.9408 1151.9661 1172.6150 1209.9382 1223.5024 1230.8940 1241.6893 1246.4658 1267.0651 1269.9306 1281.1344 1288.2003 1302.0020 1318.1904 1334.4792 1348.6432 1350.7914 1363.4267 1372.9917 1390.1436 1409.4762 1442.4559 1449.4251 1454.2451 1461.4253 1466.9334 1474.3808 1476.5756 1486.8707 1489.3442 1567.1114 1610.6667 1643.9869 2975.4986 2978.1741 2979.1457 2982.2053 2987.8465 3025.3578 3042.4272 3047.8898 3054.3984 3056.5046 3057.2434 3074.9758 3078.0311 3125.5594 3143.3075 3146.2725 3161.8255 3166.5206 3531.6508
redmass: 7.9297 4.9925 7.6086 12.4327 3.8013 3.9863 3.2912 4.2151 1.9098 2.0627 3.5711 4.9231 4.8576 4.5641 7.1982 3.3748 4.1909 1.1890 3.6330 3.3704 4.5853 3.9453 4.1879 3.8315 5.3866 3.5007 3.8185 2.6340 3.6097 4.8712 1.6691 5.8336 6.5141 4.8899 3.7610 2.4732 1.3438 1.2212 1.1946 3.4631 2.9306 1.3925 1.7176 1.8987 1.4834 2.7900 1.3656 1.4869 2.9176 3.8280 1.6476 3.8553 2.9043 1.5707 2.1375 1.6270 1.3807 1.4666 1.4802 2.0872 1.4481 2.6381 1.1517 1.1662 1.5706 1.3091 1.4455 1.1625 1.2973 2.3313 1.4550 1.5257 1.3206 1.4223 5.3597 1.2143 3.7600 1.0795 1.0893 1.0902 1.1132 1.1005 1.0640 1.0449 1.2059 2.3217 7.1104 6.8532 8.7018 1.0365 1.0589 1.0598 1.0592 1.0623 1.0984 1.1044 1.1039 1.0565 1.0708 1.0846 1.1014 1.0993 1.0893 1.1126 1.1126 1.0945 1.0932 1.0642
irintensity: 0.0014 0.1252 0.3030 0.8430 0.2145 1.0267 0.4767 0.0319 1.0286 1.4562 2.2266 0.3863 0.7251 5.2225 3.3972 9.7115 0.0772 0.5047 2.4484 2.2305 1.0892 11.0318 6.8607 1.5824 20.9796 27.7506 22.0248 6.9866 10.0876 37.4291 147.6498 71.0521 55.1139 13.3409 32.2235 16.7736 10.0304 3.0227 12.1108 1.1752 4.6711 13.8172 5.8614 1.4232 6.3950 35.6743 1.9472 5.1473 214.5415 1.3249 0.5058 14.3924 2.2796 9.9348 30.4556 117.9528 44.9321 28.8008 34.7261 1.3130 3.3356 47.7697 17.6027 8.7655 12.5265 1.9524 2.5203 1.6748 20.3931 94.9712 9.4700 15.4059 3.2415 4.4462 1.7470 10.7311 21.7606 6.4623 2.3079 2.3395 18.4080 4.1704 4.4287 12.2192 16.6276 59.2223 45.6775 27.7448 331.7325 35.0449 18.6367 2.1881 29.8352 49.8402 4.9580 7.6503 30.2638 12.6721 15.0475 13.4854 76.5788 40.7314 13.5102 9.6597 31.4797 4.9726 1.1254 49.7687
temp: 298.150 k
press: 1.00000 atm
elementType: 17 17 8 8 7 6 6 6 6 6 6 6 6 6 6 6 6 6 6 1 1 1 1 1 1 1 1 1 1 1 1 1 1 1 1 1 1 1
symmnumber: 1
zpe: 800066.0 jmol-1
zpe.correction: 0.304729 hartree
zpe.thermalcorrener: 0.326109 hartree
zpe.thermalcorrenthalpy: 0.327053 hartree
zpe.thermalcorrgfe: 0.249021 hartree
zpe.sumelectzpe: -1668.764954 hartree
zpe.sumelectthermal: -1668.743574 hartree
zpe.sumelectthermalent: -1668.742630 hartree
zpe.sumelectthermalfe: -1668.820662 hartree
dipole: 0.1778 2.0161 -0.8623
dipole: 2.2000
quadrupole: -145.1347 -122.0094 -140.2770
quadrupole: 6.6951 -3.8654 -14.2762
quadrupole: -9.3276 13.7976 -4.4700 6.6951 -3.8654 -14.2762
hfenergy: -1669.0696832 hartree
pointgroup: C01 [X(C14H19Cl2N1O2)]
dipole: 0.2342576 0.8232733 -0.1284416 debye
polarizability: 220.5996975|7.3330505|194.6269059|-5.679944|-2.9641464|160.9155995 unknown
InChI: InChI=1S/C14H19Cl2NO2/c1-2-3-11-4-5-12(14(18)19)10-13(11)17(8-6-15)9-7-16/h4-5,10,18H,2-3,6-9H2,1H3
charge 0 multiplicity 1
38 atoms
Cl 1.837056 -3.189922 -3.446874
Cl 3.039088 -1.767144 3.394654
O  -3.422326 -2.00592 0.884838
O  -4.773345 -0.128711 0.670959
N  1.311476 -0.613994 -0.216355
C  0.05435 0.095341 -0.161347
C  -0.009256 1.493175 -0.472477
C  1.228847 2.2958 -0.832057
C  1.770396 -1.153481 -1.504687
C  2.187487 -0.627824 0.963476
C  1.685727 3.253695 0.30804
C  -1.126075 -0.600282 0.190274
C  -1.274248 2.13904 -0.420232
C  -2.376078 0.063094 0.241713
C  -2.444932 1.444998 -0.069309
C  1.237455 -2.578125 -1.753333
C  1.89236 -1.829323 1.883104
C  2.933215 4.070901 -0.086603
C  -3.630642 -0.643486 0.605672
H  2.063374 1.615577 -1.079707
H  1.025292 2.908306 -1.733065
H  1.43369 -0.500762 -2.333662
H  2.877087 -1.170808 -1.528594
H  3.247033 -0.667617 0.644212
H  2.054851 0.304128 1.54518
H  1.897075 2.663709 1.221374
H  0.8539 3.937876 0.566349
H  -1.074286 -1.667817 0.423051
H  -1.333884 3.205874 -0.667203
H  -3.41771 1.946159 -0.03368
H  0.138745 -2.608395 -1.79893
H  1.620596 -3.30621 -1.022554
H  2.098554 -2.79415 1.395828
H  0.868846 -1.803276 2.285735
H  3.787013 3.407768 -0.320461
H  2.736388 4.692752 -0.980192
H  3.243864 4.744446 0.732303
H  -4.295881 -2.419293 1.11976
