program: Gaussian 09
title: 000029420
version: EM64L-G09RevD.01
frameworkgroup: C1[X(C5H12O2)]
method: RPBEPBE
basis: SDD
operation: Freq
keyword: #pfreq=noraman
keyword: PBEPBE/SDD
title: #p freq=noraman PBEPBE/SDD
converged: YES YES NO NO
title: Mulliken charges:
elementType: O O C C C C C H H H H H H H H H H H H
charge: -0.273694 -0.421432 0.036635 -0.335250 -0.698737 -0.213726 -0.677611 0.164874 0.174094 0.234933 0.210011 0.221847 0.228789 0.181387 0.183473 0.198887 0.234183 0.227727 0.323610
chargesum: 0.00000
title: Mulliken charges with hydrogens summed into heavy atoms:
elementType: O O C C C C C
charge: -0.273694 -0.097822 0.201510 0.073777 -0.038091 0.151134 -0.016813
polarizability: 7.12419467e+01 -2.66062364e+00 6.21958571e+01 3.97838022e-01 -8.70904805e-01 5.57383810e+01
1716.lowfreq: -13.7358 -5.7677 0.0005 0.0008 0.0010 2.7761 41.1592 74.0658 104.5208
frequency: 40.7636 74.0113 104.5053 172.2575 199.0995 229.6641 246.4364 249.5879 331.4200 424.9581 456.6512 503.1301 769.1572 815.4638 865.9402 916.9038 932.1742 993.5883 1051.9201 1068.4883 1083.4887 1114.4552 1120.5762 1134.6920 1211.6686 1249.0245 1285.9523 1317.5173 1338.0316 1372.9455 1381.6366 1387.0898 1396.3088 1449.2310 1457.9285 1465.3595 1472.5193 1479.9998 1492.7745 2888.3578 2916.6914 2951.8768 2963.4395 2983.9242 2994.2613 3077.3160 3086.2039 3090.2629 3091.6906 3102.9010 3554.7106
redmass: 1.7252 3.7139 2.1961 1.8301 1.2367 1.3737 1.9420 1.4161 3.2389 2.9840 2.3697 3.4808 2.5909 1.0906 1.8324 1.5881 2.4362 3.3385 3.2072 1.7295 3.1637 2.0551 1.7986 1.4347 1.5255 1.1599 1.1984 1.2093 1.3142 1.2792 1.2860 1.2186 1.3135 1.0785 1.0406 1.0564 1.0539 1.0474 1.0758 1.0824 1.0553 1.0688 1.1053 1.0365 1.0359 1.0982 1.0964 1.0984 1.0989 1.1010 1.0661
irintensity: 1.3228 3.4606 11.8482 14.9894 9.6100 0.5273 61.0968 69.1785 4.1776 6.9050 18.8481 5.7533 3.8185 3.1226 17.2869 2.9211 29.8733 105.6963 39.2664 34.9578 58.7399 8.3772 37.0636 5.4779 16.4471 0.3731 1.9700 37.2330 17.8019 2.7639 0.5730 35.0216 19.6103 2.9217 11.4002 11.1985 4.6194 8.4900 7.4734 59.6955 83.1287 71.5876 61.4594 36.3388 23.9256 26.5353 17.7660 31.1173 48.1045 36.0487 5.0556
temp: 298.150 k
press: 1.00000 atm
elementType: 8 8 6 6 6 6 6 1 1 1 1 1 1 1 1 1 1 1 1
symmnumber: 1
zpe: 432802.7 jmol-1
zpe.correction: 0.164846 hartree
zpe.thermalcorrener: 0.174494 hartree
zpe.thermalcorrenthalpy: 0.175438 hartree
zpe.thermalcorrgfe: 0.129849 hartree
zpe.sumelectzpe: -347.540438 hartree
zpe.sumelectthermal: -347.530790 hartree
zpe.sumelectthermalent: -347.529845 hartree
zpe.sumelectthermalfe: -347.575434 hartree
dipole: 0.4388 2.4725 2.4428
dipole: 3.5033
quadrupole: -42.2262 -48.1768 -41.8193
quadrupole: -3.6113 -1.5262 -2.8383
quadrupole: 1.8479 -4.1027 2.2548 -3.6113 -1.5262 -2.8383
hfenergy: -347.7052836 hartree
pointgroup: C01 [X(C5H12O2)]
dipole: 0.2639561 1.0270975 0.8803793 debye
dipolederiv: -1.1691752 0.2402335 -0.0786541 0.1870617 -0.5295456 0.0624323 -0.0624916 0.0198531 -0.4024169 -0.6695953 -0.1277596 0.0158018 -0.1310427 -0.7064582 0.2166703 0.0419468 0.2651985 -0.2017567 0.6357136 -0.2236117 -0.0405667 -0.2909079 0.4193653 -0.009826 -0.2338747 -0.0446715 0.3516274 0.3541368 0.0855171 -0.0402601 0.0360733 0.5723373 -0.1690182 -0.0612234 -0.174109 0.2903269 -0.0525748 -0.0538091 -0.0043941 0.0540781 -0.2038747 0.049577 0.0201813 0.0487594 0.0461075 0.7755592 -0.0515653 0.1058175 0.0508902 0.3558815 -0.078383 0.2550366 -0.1252032 0.4053023 -0.0788889 0.0777557 0.0490962 0.0809173 -0.0027704 -0.0278504 0.0359425 -0.0253644 0.0428877 -0.0307175 0.0027332 -0.010853 0.0424199 -0.0147541 0.0556244 0.0808857 0.0273815 -0.250481 -0.1542989 0.1288852 0.0076197 0.1175183 -0.1391571 0.0271302 0.0554978 -0.0119031 0.0557308 0.1015147 -0.0086419 0.0452774 -0.0190382 0.0473825 -0.009941 0.0042979 0.0143753 -0.1029734 -0.0726319 0.1301682 0.0849739 0.114109 0.0099804 -0.0289225 0.0874922 -0.048492 0.0449151 -0.0834693 -0.1370987 -0.0548099 -0.1082722 0.0269724 -0.0137006 -0.0649375 -0.0275581 0.0707917 0.1042048 0.0141083 -0.0252634 -0.0009266 0.0728539 -0.0169378 -0.0317755 0.051803 -0.1349894 -0.0580319 -0.0332996 -0.0226211 -0.1121581 -0.2243066 -0.0406363 -0.0499537 0.0058052 0.0308424 -0.0504011 0.0032822 0.081808 -0.0057133 0.0334944 0.063356 -0.0404482 0.0661816 -0.2314389 -0.1420975 0.0149415 -0.0987927 -0.005205 0.0928143 -0.0255407 -0.12468 -0.0149842 0.0287203 0.085194 -0.0847722 0.0043206 -0.0287112 -0.1288643 -0.0087316 0.0283669 -0.0062549 0.0943688 0.0991234 -0.0022866 0.0231416 -0.002013 0.0658671 0.0773428 0.0761721 0.0468468 -0.1246383 0.4064358 0.0252199 -0.0416416 0.0209206 0.2527818 -0.1226451 -0.0164352 -0.0676642 -0.0129262 unknown
polarizability: 70.7785385|-3.3314774|62.495261|0.33847|-1.3666773|55.9023853 unknown
InChI: InChI=1S/C5H12O2/c1-3-7-5(2)4-6/h5-6H,3-4H2,1-2H3
charge 0 multiplicity 1
19 atoms
O  0.565073 -0.116479 -0.327412
O  -2.064114 -1.44976 0.287002
C  -0.59286 0.599806 0.230243
C  -1.84864 -0.120111 -0.291488
C  -0.585832 2.086599 -0.184217
C  1.806514 0.044385 0.442379
C  2.866157 -0.835312 -0.221751
H  -0.565421 0.527982 1.345715
H  -2.734305 0.531582 -0.124477
H  -1.734654 -0.299806 -1.373244
H  -1.422606 2.636447 0.286032
H  0.354853 2.578486 0.119936
H  -0.67877 2.177438 -1.281262
H  2.130793 1.108739 0.450899
H  1.634456 -0.26978 1.49691
H  3.82503 -0.767257 0.324129
H  2.536957 -1.888339 -0.231062
H  3.032002 -0.517219 -1.265467
H  -2.060535 -1.374904 1.275035
