program: Gaussian 09
title: 000029397
version: EM64L-G09RevD.01
frameworkgroup: C1[X(C5H8O2)]
method: RPBEPBE
basis: SDD
operation: Freq
keyword: #p
keyword: freq=noraman
keyword: PBEPBE/SDD
title: #p freq=noraman PBEPBE/SDD
converged: YES YES NO NO
title: Mulliken charges:
elementType: O O C C C C C H H H H H H H H
charge: -0.223964 -0.225133 -0.245164 -0.665667 -0.035991 -0.254593 -0.099627 0.217537 0.219063 0.213314 0.237867 0.237527 0.211563 0.274073 0.139196
chargesum: 0.00000
title: Mulliken charges with hydrogens summed into heavy atoms:
elementType: O O C C C C C
charge: -0.223964 -0.225133 0.191435 0.023041 0.175572 0.019480 0.039569
polarizability: 1.18106322e+02 -5.79343382e+00 5.22692951e+01 1.10799990e-01 1.25104838e-01 3.59115166e+01
1716.lowfreq: -0.0009 -0.0008 -0.0004 2.4168 4.3560 24.9539 54.9477 82.5976 110.2503
frequency: 53.0553 82.5725 110.2495 172.5363 240.6227 267.5794 336.9326 356.2896 482.8331 577.1359 811.3797 837.6898 842.1097 945.7754 978.8115 1023.6583 1108.5458 1131.3873 1144.2228 1179.1258 1237.6305 1262.1127 1306.2923 1361.6227 1393.4084 1404.2779 1460.6130 1473.3913 1485.8594 1600.6191 1647.7954 2835.0963 2975.2690 3002.3418 3039.1805 3060.2420 3099.6571 3112.9266 3167.3561
redmass: 2.6675 2.6439 4.4509 3.9853 1.2163 3.4920 2.5757 5.5898 3.6399 3.9921 1.0961 3.1667 1.6701 1.3332 1.3708 2.4790 2.4030 1.4312 2.4171 5.3888 1.7702 1.1438 1.2210 1.2822 1.2662 1.2669 1.0388 1.0695 1.0673 6.9540 4.7853 1.0834 1.0558 1.0366 1.1085 1.0907 1.0988 1.1018 1.0930
irintensity: 1.0441 1.2863 2.0348 5.4081 1.1640 6.7586 0.1118 9.2760 12.8375 2.2585 5.4008 28.4217 3.3259 41.9826 35.9630 57.1223 77.0247 6.3208 231.4052 235.4967 5.6155 0.0289 9.8701 73.9260 18.4102 30.0875 12.6590 13.8852 9.6300 97.4721 465.3253 127.9544 49.3254 17.2504 29.8760 23.9056 27.8558 32.6367 2.6603
temp: 298.150 k
press: 1.00000 atm
elementType: 8 8 6 6 6 6 6 1 1 1 1 1 1 1 1
symmnumber: 1
zpe: 314666.9 jmol-1
zpe.correction: 0.119850 hartree
zpe.thermalcorrener: 0.128202 hartree
zpe.thermalcorrenthalpy: 0.129146 hartree
zpe.thermalcorrgfe: 0.086470 hartree
zpe.sumelectzpe: -345.181251 hartree
zpe.sumelectthermal: -345.172900 hartree
zpe.sumelectthermalent: -345.171955 hartree
zpe.sumelectthermalfe: -345.214632 hartree
dipole: -6.3120 2.6211 0.0054
dipole: 6.8346
quadrupole: -55.8316 -39.3317 -42.7113
quadrupole: 0.8046 0.0059 0.0281
quadrupole: -9.8734 6.6265 3.2469 0.8046 0.0059 0.0281
hfenergy: -345.3011014 hartree
pointgroup: C01 [X(C5H8O2)]
dipole: 2.4637674 1.0764562 0.0381443 debye
dipolederiv: -2.1949308 -0.1870656 -0.073572 0.4268553 -0.2817576 0.0199663 -0.1094676 -0.006506 -0.282303 -1.307444 -0.1001164 -0.0362926 -0.2728646 -0.4813291 -0.0034637 -0.0238497 0.00441 -0.356659 1.1600308 0.1826605 0.0239799 0.4531037 0.3574124 0.0227325 0.0023632 0.0097544 0.4082339 -0.1491208 0.0551185 -0.0098252 0.0349774 0.009836 0.0020227 -0.0082454 0.0032006 0.0433929 1.8971127 0.0825536 0.081417 -0.3637848 0.2516848 -0.0369183 0.1090242 -0.0175038 -0.0229291 -1.3520522 -0.0103015 -0.0508097 0.0766286 -0.0562764 -0.007935 -0.0583703 -0.012149 -0.2165283 1.7989288 0.1123446 0.0704982 -0.2620778 0.6965413 -0.0559206 0.0972099 -0.0386448 0.0877757 -0.0603495 0.0147718 -0.0449631 -0.106412 -0.0339892 0.0941431 0.022392 0.1348989 -0.0928393 -0.0634995 0.0265522 0.0414566 -0.1047456 -0.0557757 -0.1062542 -0.0107206 -0.1367893 -0.0693368 -0.1033595 -0.0961125 -0.0038072 -0.1167066 0.0077774 0.0010808 -0.0027559 0.0017044 0.1201019 0.1144385 -0.000802 0.022227 0.0478469 0.0311479 0.0999302 -0.0049585 0.1070206 -0.0616756 0.1150462 0.0055113 -0.0105987 0.0554144 0.0117075 -0.103129 0.011779 -0.1136843 -0.0433731 0.0487146 0.0013926 -0.0060992 0.0407151 -0.1156586 0.022969 -0.0082378 0.0218606 0.180468 0.0661027 0.0167199 -0.0073862 0.0443947 -0.0288971 0.0184729 -0.0092251 0.0170563 0.1982667 0.030382 -0.103227 0.0037752 0.0466551 -0.3124237 0.0323035 -0.0069376 0.0253713 0.107405 unknown
polarizability: 117.7374742|7.0841396|52.4395783|3.1878052|-0.8211742|36.110081 unknown
InChI: InChI=1S/C5H8O2/c1-2-7-5-3-4-6/h3-5H,2H2,1H3
charge 0 multiplicity 1
15 atoms
O  1.192534 -0.289074 0.078552
O  -3.620746 -0.27886 -0.140501
C  2.375763 0.620008 0.075839
C  3.61711 -0.26066 0.15762
C  -0.041458 0.314635 -0.019132
C  -1.206272 -0.406113 -0.020574
C  -2.489361 0.287986 -0.129235
H  2.360206 1.21811 -0.856696
H  2.299492 1.300385 0.946756
H  4.52571 0.36807 0.160535
H  3.606897 -0.864578 1.080451
H  3.667674 -0.944728 -0.705989
H  -0.053738 1.415439 -0.098081
H  -1.199309 -1.49786 0.057977
H  -2.412402 1.406041 -0.205723
