program: Gaussian 09
title: 000029421
version: EM64L-G09RevD.01
frameworkgroup: C1[X(C10H18O2)]
method: RPBEPBE
basis: SDD
operation: Freq
keyword: #pfreq=noraman
keyword: PBEPBE/SDD
title: #p freq=noraman PBEPBE/SDD
converged: NO YES NO NO
title: Mulliken charges:
elementType: O O C C C C C C C C C C H H H H H H H H H H H H H H H H H H
charge: -0.275018 -0.261557 -0.364140 -0.348622 -0.390120 -0.354696 -0.285757 -0.694267 0.248745 -0.338850 -0.070866 -0.733777 0.190795 0.190673 0.189553 0.189655 0.210652 0.210727 0.195562 0.195480 0.225399 0.225241 0.216524 0.210072 0.210130 0.256492 0.251637 0.234329 0.231689 0.234319
chargesum: 0.00000
title: Mulliken charges with hydrogens summed into heavy atoms:
elementType: O O C C C C C C C C C C
charge: -0.275018 -0.261557 0.017328 0.030586 0.031258 0.036346 0.164883 -0.057542 0.248745 -0.082359 0.180771 -0.033440
polarizability: 1.83283949e+02 -2.64215010e+00 1.02654741e+02 -9.81257818e-02 -4.67589336e-02 8.10147280e+01
1716.lowfreq: -0.0008 0.0002 0.0005 3.9543 5.7699 17.8523 25.4737 44.3881 51.1639
frequency: 23.5867 44.3658 49.2588 68.4826 94.1770 114.2601 119.7062 139.0506 160.6981 186.2735 203.3629 215.6184 228.8669 241.5230 286.8147 375.1505 408.5254 422.1791 503.8737 660.6084 706.3423 726.4535 746.9689 794.4118 843.9652 882.0798 883.5761 889.4225 912.8412 986.3841 987.8984 991.5947 1011.8772 1051.4693 1053.5983 1071.1747 1083.6719 1098.9256 1127.2326 1150.1606 1157.7447 1195.9665 1237.8310 1243.4699 1272.3950 1287.9920 1291.0228 1292.3935 1293.4220 1300.1013 1340.3103 1357.8181 1375.9724 1391.5505 1394.7763 1457.7507 1464.7125 1465.1234 1466.8482 1470.9448 1477.5986 1477.7542 1485.2809 1490.6230 1613.3706 1669.7641 2955.6855 2960.1797 2970.1274 2970.3716 2973.6405 2989.8397 2992.3237 2998.4751 3008.5102 3031.0499 3043.0176 3044.3596 3069.7309 3072.6662 3072.8663 3085.9509 3109.2651 3152.0544
redmass: 4.0845 3.9272 1.8349 3.1206 1.8853 3.7330 1.7415 2.0620 1.6720 4.3648 1.6774 4.2562 1.1401 3.1882 3.8413 3.8849 3.4325 3.2657 3.9095 3.3628 6.3571 1.0662 1.0920 1.1520 1.8869 4.0948 1.1989 2.0715 2.2635 1.1439 3.8023 1.0782 3.8271 3.1249 1.5976 2.6643 2.1140 2.0500 2.7883 1.4724 3.0167 1.5163 1.2866 1.2864 1.1129 1.3917 1.0837 1.2885 1.1103 1.5327 1.4384 1.6328 1.5830 1.2180 1.2331 1.0472 1.0722 1.0750 1.0700 1.0754 1.0681 1.0456 1.0803 1.0952 11.2049 5.8284 1.0589 1.0590 1.0591 1.0373 1.0365 1.0598 1.0979 1.0567 1.1015 1.1037 1.0957 1.1046 1.1016 1.1065 1.0993 1.0964 1.0938 1.0921
irintensity: 0.0244 0.5532 1.0781 0.8088 2.1756 1.0751 0.1144 0.0235 0.5148 2.4188 0.9481 0.1810 0.0297 3.0624 8.5603 3.1836 1.5210 8.3727 0.1105 11.2400 6.8396 12.3197 0.1486 1.7881 2.0588 5.4300 1.2599 2.2815 8.1126 0.2395 159.8318 60.3035 0.2898 41.7306 0.2198 33.1500 33.2581 114.5692 2.6343 1.4730 228.7447 0.0005 3.7752 0.0000 0.1477 74.2589 0.1349 6.9192 0.8867 63.1101 0.4658 0.3382 1.3087 11.7452 14.2422 16.7236 38.5608 6.2613 0.1611 0.9983 2.0469 11.0824 3.1538 25.4470 174.1502 110.8566 0.0051 8.0788 90.2004 18.6153 35.4601 13.5551 0.4268 50.1254 0.5969 31.6443 18.0807 17.3965 30.4156 142.7443 53.7512 8.9649 17.4231 8.6771
temp: 298.150 k
press: 1.00000 atm
elementType: 8 8 6 6 6 6 6 6 6 6 6 6 1 1 1 1 1 1 1 1 1 1 1 1 1 1 1 1 1 1
symmnumber: 1
zpe: 681985.6 jmol-1
zpe.correction: 0.259755 hartree
zpe.thermalcorrener: 0.275042 hartree
zpe.thermalcorrenthalpy: 0.275986 hartree
zpe.thermalcorrgfe: 0.215408 hartree
zpe.sumelectzpe: -541.329905 hartree
zpe.sumelectthermal: -541.314618 hartree
zpe.sumelectthermalent: -541.313674 hartree
zpe.sumelectthermalfe: -541.374251 hartree
dipole: 0.0897 -1.7373 0.0047
dipole: 1.7396
quadrupole: -58.2899 -79.1521 -74.3913
quadrupole: -8.0217 -0.0104 0.0097
quadrupole: 12.3212 -8.5410 -3.7802 -8.0217 -0.0104 0.0097
hfenergy: -541.5896597 hartree
pointgroup: C01 [X(C10H18O2)]
dipole: 0.0314052 -0.6835327 0.0142303 debye
polarizability: 183.2504836|-3.1070964|102.6788769|-0.2199664|-0.4354494|81.0240572 unknown
InChI: InChI=1S/C10H18O2/c1-3-5-6-7-9-12-10(11)8-4-2/h4,8H,3,5-7,9H2,1-2H3
charge 0 multiplicity 1
30 atoms
O  1.085338 -0.277877 0.003695
O  2.395624 1.658753 -0.042328
C  -2.674018 0.439162 -0.003836
C  -3.915736 -0.480365 0.011872
C  -1.344135 -0.350644 0.007774
C  -5.250404 0.29925 -0.00142
C  -0.132602 0.581152 -0.009557
C  -6.48639 -0.625754 0.013519
C  2.312897 0.403167 -0.014885
C  3.432015 -0.565456 0.002022
C  4.726975 -0.1428 -0.012923
C  5.934815 -1.039367 0.002192
H  -2.711113 1.117968 0.873601
H  -2.712728 1.089342 -0.902664
H  -3.880821 -1.160382 -0.864718
H  -3.880907 -1.130405 0.910909
H  -1.29849 -1.022999 -0.87055
H  -1.29644 -0.993244 0.907986
H  -5.283961 0.978741 0.874649
H  -5.283373 0.949242 -0.899648
H  -0.105871 1.216557 -0.914846
H  -0.103454 1.246993 0.873497
H  -7.427257 -0.045623 0.000577
H  -6.489954 -1.295867 -0.866882
H  -6.493887 -1.262411 0.918376
H  3.164036 -1.626976 0.026841
H  4.900498 0.943794 -0.038158
H  6.564594 -0.860657 -0.891277
H  5.660154 -2.107368 0.027987
H  6.572594 -0.819924 0.880796
