program: Gaussian 09
title: 000029398
version: EM64L-G09RevD.01
frameworkgroup: C1[X(C5H10O3)]
method: RPBEPBE
basis: SDD
operation: Freq
keyword: #pfreq=noraman
keyword: PBEPBE/SDD
title: #p freq=noraman PBEPBE/SDD
converged: YES YES NO NO
title: Mulliken charges:
elementType: O O O C C C C C H H H H H H H H H H
charge: -0.262325 -0.262352 -0.153585 0.088688 -0.467510 -0.031113 -0.501589 -0.511547 0.169058 0.241616 0.220923 0.152467 0.188815 0.249707 0.232499 0.198060 0.203691 0.244499
chargesum: 0.00000
title: Mulliken charges with hydrogens summed into heavy atoms:
elementType: O O O C C C C C
charge: -0.262325 -0.262352 -0.153585 0.257746 -0.004971 0.121353 0.169432 0.134702
polarizability: 6.52327823e+01 -6.24423684e-01 6.42144662e+01 -2.20449702e+00 2.50865556e+00 6.07827804e+01
1716.lowfreq: -11.3675 -6.6821 -0.0009 -0.0004 0.0002 6.1416 30.1176 79.1247 93.7365
frequency: 27.7350 79.1163 93.7099 94.4770 141.2937 169.3205 197.2202 246.1096 300.4716 358.6174 443.9192 507.1231 694.2339 737.0043 849.5605 865.1417 919.7855 1007.8148 1017.9595 1047.6799 1096.8558 1110.7588 1115.0856 1146.5945 1163.3921 1224.1949 1308.4089 1343.0973 1358.2470 1401.3855 1421.4546 1429.2387 1437.2477 1452.8472 1461.6483 1473.9703 1480.2349 1673.0677 2811.5416 2823.9086 2923.6157 2942.5369 2978.7596 2998.0423 3025.0487 3063.1577 3105.7953 3124.8227
redmass: 2.7808 4.3838 2.3213 2.5670 1.7143 1.1622 2.0725 2.7772 3.0947 2.7661 4.6722 5.2030 1.5917 4.9521 3.3965 2.9608 3.4558 5.8362 3.1874 2.4130 1.8728 1.2841 1.2868 1.3329 1.7945 1.2372 1.8950 1.2239 1.3146 1.1442 1.1829 1.1452 1.1315 1.0514 1.0647 1.0528 1.0527 7.7308 1.0823 1.0824 1.0350 1.0425 1.0620 1.1022 1.0966 1.0888 1.0964 1.1031
irintensity: 2.5281 6.0369 4.0537 5.0852 0.4929 2.0584 7.1178 5.0600 3.5344 6.1545 16.0401 4.3391 1.2787 6.9089 46.4767 39.3339 11.4517 90.3074 17.4648 97.4208 58.1486 4.9344 7.0652 4.1794 30.0508 33.0084 81.2509 23.7358 10.9226 17.9574 19.4119 6.0740 8.8446 10.7182 11.8046 9.8528 15.1091 110.0783 200.2012 85.6519 77.5601 76.3535 20.8760 79.9211 10.9079 39.7276 23.8378 22.5841
temp: 298.150 k
press: 1.00000 atm
elementType: 8 8 8 6 6 6 6 6 1 1 1 1 1 1 1 1 1 1
symmnumber: 1
zpe: 380970.2 jmol-1
zpe.correction: 0.145104 hartree
zpe.thermalcorrener: 0.155372 hartree
zpe.thermalcorrenthalpy: 0.156316 hartree
zpe.thermalcorrgfe: 0.108379 hartree
zpe.sumelectzpe: -421.476582 hartree
zpe.sumelectthermal: -421.466314 hartree
zpe.sumelectthermalent: -421.465369 hartree
zpe.sumelectthermalfe: -421.513307 hartree
dipole: 2.0719 2.2797 3.8575
dipole: 4.9366
quadrupole: -43.7020 -44.5549 -50.5847
quadrupole: -2.1950 -5.9722 0.6056
quadrupole: 2.5786 1.7256 -4.3042 -2.1950 -5.9722 0.6056
hfenergy: -421.6216856 hartree
pointgroup: C01 [X(C5H10O3)]
dipole: 0.319543 -1.1832066 -1.5066759 debye
dipolederiv: -0.9633494 -0.2514199 -0.1518251 -0.261186 -0.6430203 -0.0323946 -0.2370624 -0.0197746 -0.4747239 -0.5160742 -0.0788282 0.0164292 -0.1291317 -1.0818931 0.1280763 0.0376529 0.4006667 -0.4623748 -0.416825 0.0869325 -0.019666 0.0926164 -0.3671836 -0.1402524 0.0620004 -0.1856318 -0.7608323 0.923616 0.1630413 0.0090095 0.3709366 1.1342454 -0.0177657 0.0315912 -0.3914658 0.6676727 -0.2559838 0.1828568 0.0630673 0.1988604 -0.1049769 -0.1456998 0.1472185 -0.1577662 -0.2436145 0.786598 -0.4022568 0.01604 -0.3922008 0.3861014 0.2584775 -0.0313535 0.2815832 0.9474655 0.6340912 0.077535 0.0628043 -0.0999929 0.2122695 -0.0005073 0.0923536 0.0383706 0.3391486 0.3444226 0.0325751 -0.0236658 0.0292457 0.7035917 0.0009092 0.0090253 0.1413059 0.2105271 -0.1092226 0.0926903 0.1251911 0.0207111 -0.1353389 -0.1415617 0.0469549 -0.038714 -0.1528839 0.0770305 0.0506587 0.041606 0.0295228 0.0055356 0.1140954 0.0077306 0.1014904 -0.0030417 -0.0368581 -0.0611202 -0.0257574 -0.0799103 -0.0138992 -0.0971623 -0.0329343 -0.0426029 0.1082777 -0.2650981 0.1624262 -0.1221179 0.144918 0.0068714 0.0212502 -0.1563762 0.0407193 -0.0731952 -0.0882666 0.0408448 0.0248918 0.1599061 0.0038063 -0.0984167 0.1072167 -0.1110638 -0.0791695 0.031169 -0.0062004 0.0117004 0.0716011 0.0598828 0.1170387 -0.0477399 0.080314 -0.0807891 -0.0010277 -0.0849301 -0.0356089 -0.1254852 -0.0801612 -0.0364019 -0.0325526 -0.0212914 0.1091166 -0.0995491 0.0908613 0.1225016 0.0216885 -0.0379613 -0.0110446 0.1366612 -0.1429235 -0.0152271 -0.1542537 -0.0938251 -0.105803 -0.0395336 -0.033071 -0.0079628 -0.1336949 -0.1058462 0.0184273 0.1095811 -0.0018412 -0.0087969 -0.0125662 -0.0147986 0.0893224 -0.0066914 0.1326301 -0.0547835 unknown
polarizability: 65.3342879|-0.1311351|63.9290486|3.2805686|1.1084703|60.9666924 unknown
InChI: InChI=1S/C5H10O3/c1-7-5(8-2)3-4-6/h4-5H,3H2,1-2H3
charge 0 multiplicity 1
18 atoms
O  1.102755 0.935397 -0.224145
O  0.164486 -1.09912 0.559773
O  -1.680653 1.35067 1.080939
C  0.314939 -0.201538 -0.596817
C  -1.03153 0.328427 -1.102443
C  -1.90392 1.111181 -0.122325
C  2.437612 0.587593 0.280671
C  0.037629 -2.509398 0.193134
H  0.830193 -0.7821 -1.40933
H  -0.858815 0.986751 -1.978557
H  -1.648375 -0.515445 -1.477112
H  -2.847402 1.482511 -0.612187
H  3.002161 -0.012068 -0.466009
H  2.359917 0.022823 1.225147
H  2.949075 1.547277 0.448565
H  0.877393 -2.843985 -0.454192
H  -0.920591 -2.723602 -0.325785
H  0.060527 -3.070075 1.140472
