program: Gaussian 09
title: 000029407
version: EM64L-G09RevD.01
frameworkgroup: C1[X(C12H11NO3)]
method: RPBEPBE
basis: SDD
operation: Freq
keyword: #p
keyword: freq=noraman
keyword: PBEPBE/SDD
title: #p freq=noraman PBEPBE/SDD
converged: YES YES NO NO
title: Mulliken charges:
elementType: O O O N C C C C C C C C C C C C H H H H H H H H H H H
charge: -0.263218 -0.180165 -0.178124 -0.343321 0.501663 -0.360988 -0.335207 0.344621 0.149958 0.148716 -0.351533 -0.370920 -0.254092 -0.253655 -0.245135 -0.684449 0.262431 0.266059 0.248060 0.253098 0.276531 0.276740 0.209652 0.209551 0.232949 0.232858 0.207919
chargesum: 0.00000
title: Mulliken charges with hydrogens summed into heavy atoms:
elementType: O O O N C C C C C C C C C C C C
charge: -0.263218 -0.180165 -0.178124 -0.343321 0.501663 -0.098557 -0.069148 0.344621 0.149958 0.148716 -0.103473 -0.117822 0.022439 0.023085 0.174069 -0.010722
polarizability: 2.18903063e+02 -2.39176654e+00 1.49034117e+02 3.54664994e-01 2.77795051e+00 7.60868690e+01
1716.lowfreq: -3.4229 0.0003 0.0007 0.0007 4.1138 7.0285 38.1302 46.0226 82.1101
frequency: 38.1129 45.9917 82.1071 90.6532 118.5218 127.7451 176.0819 205.1298 226.8081 245.7851 283.1484 324.4892 358.7913 387.1427 413.0354 424.3839 472.5135 516.0285 567.2575 596.7148 620.3246 632.3577 661.3348 683.4729 722.6832 733.8454 778.6773 801.8975 818.6593 828.9905 836.1158 903.2345 933.5916 939.6335 940.3604 956.6242 999.1549 1004.9838 1037.4411 1057.0151 1096.0102 1116.6224 1131.7914 1137.0777 1182.5002 1198.9509 1231.3945 1264.7705 1285.4962 1311.6249 1355.4428 1367.0829 1381.4526 1401.4729 1429.1730 1461.6089 1477.2356 1487.7349 1506.9521 1583.5963 1590.4534 1619.5482 1626.8234 1674.3623 2955.9843 2997.9719 3015.0165 3095.3302 3106.7667 3162.5538 3162.7036 3184.0510 3188.0326 3205.8452 3234.5746
redmass: 4.6396 3.7749 4.9871 5.5615 1.7504 6.3943 5.5754 6.2360 6.3985 1.2292 4.2330 5.6182 5.1343 6.7502 3.0290 4.9434 5.9148 2.6488 3.7715 8.3909 2.9761 4.3085 6.2651 7.5923 3.8198 7.1080 4.6740 1.2777 1.8044 1.3159 1.3987 3.4057 1.3842 5.3216 1.3845 1.3559 4.3087 2.6695 2.8201 1.2283 4.5150 2.2097 1.3535 1.4408 1.4473 2.6377 2.9142 1.1384 1.7190 1.3003 5.0612 1.9085 2.8303 1.3019 3.6949 1.0397 1.0828 1.1418 2.2108 7.4130 7.0136 10.8570 6.5596 11.4816 1.0554 1.0362 1.1076 1.0989 1.1014 1.0879 1.0891 1.0958 1.0969 1.0893 1.1110
irintensity: 2.2470 0.2660 4.1296 0.7520 2.2171 6.9150 2.5318 1.7515 3.1662 1.2259 0.1476 0.9884 2.9914 0.9814 0.7469 5.2827 5.3297 13.1310 7.4759 26.8926 5.4872 3.6753 1.7864 46.7738 4.5672 1.1058 3.6558 10.8706 24.1070 65.8393 45.7828 42.5652 2.8064 7.5700 0.8775 1.2852 12.2060 2.5952 68.1547 41.1090 50.3641 1.6437 38.2233 5.5756 157.2965 3.7390 300.3311 0.0267 1.5890 1.7656 160.4671 42.1004 12.9491 44.9609 2.4985 12.0046 44.6541 63.5853 225.9867 28.4266 12.2619 397.0919 37.5481 5.4658 38.0628 26.3420 35.4839 28.4731 34.3437 15.4014 2.6110 3.8944 0.0720 0.0026 1.1667
temp: 298.150 k
press: 1.00000 atm
elementType: 8 8 8 7 6 6 6 6 6 6 6 6 6 6 6 6 1 1 1 1 1 1 1 1 1 1 1
symmnumber: 1
zpe: 537236.0 jmol-1
zpe.correction: 0.204622 hartree
zpe.thermalcorrener: 0.218859 hartree
zpe.thermalcorrenthalpy: 0.219803 hartree
zpe.thermalcorrgfe: 0.162568 hartree
zpe.sumelectzpe: -743.146028 hartree
zpe.sumelectthermal: -743.131791 hartree
zpe.sumelectthermalent: -743.130847 hartree
zpe.sumelectthermalfe: -743.188082 hartree
dipole: -0.0619 1.3920 0.6071
dipole: 1.5199
quadrupole: -62.9175 -101.5490 -94.2277
quadrupole: -4.1863 -2.7472 6.7290
quadrupole: 23.3139 -15.3176 -7.9963 -4.1863 -2.7472 6.7290
hfenergy: -743.35065 hartree
pointgroup: C01 [X(C12H11N1O3)]
dipole: 0.0168356 0.5437611 -0.2481914 debye
polarizability: 218.7496104|2.0629759|148.9164739|-4.8737386|-3.9995066|76.3579656 unknown
InChI: InChI=1S/C12H11NO3/c1-2-16-10-5-3-9(4-6-10)13-11(14)7-8-12(13)15/h3-8H,2H2,1H3
charge 0 multiplicity 1
27 atoms
O  3.72774 -0.51597 0.015063
O  -2.173759 2.353466 0.468905
O  -2.532704 -2.261813 -0.454946
N  -1.914839 0.012465 0.003546
C  -0.478908 -0.096711 -0.011512
C  0.308196 0.946194 -0.549653
C  0.151969 -1.252147 0.519135
C  2.343167 -0.308691 -0.029104
C  -2.653647 1.217418 0.240874
C  -2.83134 -1.067988 -0.214238
C  1.715831 0.848976 -0.553875
C  1.551744 -1.358398 0.502002
C  -4.111222 0.845224 0.166917
C  -4.214478 -0.483591 -0.096135
C  4.601913 0.54719 -0.522943
C  6.039961 0.074631 -0.330577
H  -0.170186 1.842691 -0.951145
H  -0.448561 -2.068205 0.927617
H  2.300906 1.674167 -0.968845
H  2.054056 -2.244404 0.900907
H  -4.895594 1.587181 0.316006
H  -5.104548 -1.100308 -0.220006
H  4.411022 1.492605 0.025279
H  4.369145 0.705541 -1.596101
H  6.215802 -0.87014 -0.872465
H  6.25417 -0.093753 0.738496
H  6.743962 0.835369 -0.714001
