program: Gaussian 09
title: 000029522
version: EM64L-G09RevD.01
frameworkgroup: C1[X(C22H20N2O5)]
method: RPBEPBE
basis: SDD
operation: Freq
keyword: #p
keyword: freq=noraman
keyword: PBEPBE/SDD
title: #p freq=noraman PBEPBE/SDD
converged: YES YES NO NO
title: Mulliken charges:
elementType: O O O O O N N C C C C C C C C C C C C C C C C C C C C C C H H H H H H H H H H H H H H H H H H H H
charge: -0.270359 -0.285449 -0.293926 -0.243317 -0.237526 -0.000423 0.000342 -0.049882 -0.326658 -0.312731 0.251625 0.292516 -0.352410 0.217224 -0.383810 -0.783307 -0.245173 0.210654 -0.244799 0.231499 0.206107 -0.264518 -0.410801 -0.266760 -0.409080 -0.178540 -0.178316 -0.316154 -0.315148 0.263822 0.211415 0.234781 0.248622 0.280019 0.247654 0.233540 0.215243 0.238477 0.238598 0.225721 0.227308 0.278171 0.282228 0.276130 0.282818 0.237517 0.238024 0.249114 0.249916
chargesum: 0.00000
title: Mulliken charges with hydrogens summed into heavy atoms:
elementType: O O O O O N N C C C C C C C C C C C C C C C C C C C C C C
charge: -0.270359 -0.285449 -0.293926 -0.243317 -0.237526 -0.000423 0.000342 0.213940 0.119538 0.215910 0.251625 0.292516 -0.104756 0.217224 -0.150270 -0.090988 -0.019451 0.210654 -0.017491 0.231499 0.206107 0.013652 -0.128573 0.009369 -0.126262 0.058977 0.059708 -0.067040 -0.065232
polarizability: 2.78074751e+02 -2.67965884e+01 2.59135801e+02 1.32929076e-01 -2.08773985e+01 2.53560965e+02
1716.lowfreq: -5.1954 -0.0007 -0.0005 -0.0003 0.6750 3.4035 10.7413 13.3312 16.1625
frequency: 9.7082 13.2465 16.1304 18.4971 21.8791 24.0623 48.8772 55.0375 63.1694 84.0603 95.1780 111.8253 126.4765 138.4020 149.7724 175.9187 179.8308 188.1908 204.6915 251.5699 256.5477 268.5342 279.1798 308.4095 345.2703 371.8286 372.7469 386.0053 415.8178 430.3121 431.7187 443.0300 464.0502 475.4684 491.7449 521.8801 541.8274 593.2112 608.7880 610.5648 626.8582 685.4237 690.9158 696.5937 700.2453 716.9064 718.2482 719.5496 752.9608 756.1805 795.8472 808.2611 826.1761 830.2075 830.7532 835.8494 847.0654 874.8734 926.0736 931.6386 943.4194 944.0123 968.4952 969.1232 973.3623 985.0526 991.3153 993.8360 1000.7842 1002.2012 1002.6649 1020.1023 1022.5784 1028.6959 1046.6171 1049.9693 1051.8109 1062.2935 1077.2501 1117.2781 1118.3003 1120.9924 1140.0131 1173.3053 1190.3912 1200.3371 1200.7266 1210.5963 1226.8490 1233.8452 1236.9180 1248.5643 1288.9073 1297.5363 1311.8360 1312.4141 1326.7045 1326.8750 1346.1227 1361.2812 1377.8024 1396.3288 1401.8122 1411.3408 1412.1358 1429.4942 1453.7434 1454.1408 1457.9575 1459.5175 1466.6167 1477.1628 1490.2731 1550.2989 1550.5266 1582.7853 1583.0279 1597.7118 1608.7776 1623.1291 1629.0470 2968.3124 2982.8122 3019.5693 3034.3294 3048.4335 3060.1037 3091.3290 3092.2255 3124.7135 3135.1838 3136.8212 3137.8423 3151.7504 3152.2256 3154.6218 3161.4979 3162.3657 3168.3979 3182.0357 3184.2746
redmass: 6.2833 6.3716 4.9295 5.2898 4.5742 5.2689 7.3255 8.2414 5.2131 5.6472 5.7188 1.1399 5.0158 3.9719 5.7540 3.7616 4.3801 4.4930 4.7109 3.8878 4.4272 4.3884 4.5673 4.0216 6.5099 2.9133 2.9151 3.7534 4.0612 4.7257 4.6434 2.9100 6.6109 5.7167 3.8043 5.2131 3.4960 6.5757 7.8565 7.6975 6.3556 6.9821 7.1534 7.2931 6.9371 2.4596 1.8122 1.8235 3.5747 1.6720 4.9028 5.8104 5.6947 1.7793 1.7566 5.0489 1.3877 4.2695 1.4523 1.6248 1.3676 1.3671 1.5118 1.5117 1.3132 1.5717 4.6448 4.1470 1.8453 1.7452 2.1110 4.1174 4.7680 2.7348 1.5278 2.1111 2.8722 2.7581 2.8283 1.5957 1.7985 1.6968 1.7640 1.1252 2.3631 1.3054 1.3049 1.1118 1.5828 3.0973 1.7921 3.3931 1.4382 1.5400 10.3131 10.6621 1.2577 1.2573 1.3420 1.4361 2.9597 1.8986 1.3551 2.1771 2.1819 1.9789 2.0940 2.1431 1.0463 1.1301 1.1028 1.2188 2.2352 5.8362 5.8801 5.8959 5.9161 6.7130 6.3124 11.4097 11.5558 1.0589 1.0366 1.0603 1.0929 1.0932 1.0968 1.1057 1.1001 1.0865 1.0892 1.0889 1.0887 1.0928 1.0927 1.0932 1.0929 1.0932 1.0998 1.0990 1.0984
irintensity: 2.2278 0.4866 2.0807 2.2056 0.1318 0.1838 0.1721 0.1119 1.7104 1.2977 0.8532 0.7872 0.8078 1.0066 0.9419 2.3614 1.5276 3.6930 4.8714 5.4137 8.6496 2.0293 7.8868 1.0334 1.0262 0.8943 0.6296 5.2540 5.4011 1.1313 5.1564 3.0525 9.1660 12.3275 6.4623 3.9473 0.2558 5.3185 0.5496 2.0223 7.1484 2.5530 4.3877 4.4895 4.0520 10.3917 31.1248 87.3678 28.9001 67.0498 10.5435 2.3700 12.9959 13.0948 35.0705 21.7353 0.7999 4.1361 1.7861 2.0716 1.0468 2.1047 1.6929 3.3489 0.0198 3.3967 222.2254 79.9039 21.8766 21.1997 40.1023 3.2479 8.4307 14.5027 6.5851 38.2328 336.4511 89.8609 89.0107 28.6013 85.5219 28.3778 10.6342 12.2156 100.1495 9.2164 1.8041 34.5408 155.4998 334.8032 184.4124 120.4136 0.2134 6.5610 6.7134 7.1185 4.4823 4.1840 7.0014 3.7391 1.3147 10.5703 13.3331 19.5630 19.0786 25.1870 10.5416 6.8505 13.9119 44.7760 8.6548 11.5433 76.3908 20.5289 21.8704 53.7348 24.3133 14.8194 35.3161 191.4238 192.7926 53.5249 23.9657 7.2903 1.9690 28.5129 17.6239 13.6070 23.1576 7.1126 11.7828 9.9651 9.1906 2.3274 2.5497 38.2275 12.5487 16.1943 14.6555 7.7597 7.3907
temp: 298.150 k
press: 1.00000 atm
elementType: 8 8 8 8 8 7 7 6 6 6 6 6 6 6 6 6 6 6 6 6 6 6 6 6 6 6 6 6 6 1 1 1 1 1 1 1 1 1 1 1 1 1 1 1 1 1 1 1 1
symmnumber: 1
zpe: 986021.6 jmol-1
zpe.correction: 0.375556 hartree
zpe.thermalcorrener: 0.402082 hartree
zpe.thermalcorrenthalpy: 0.403027 hartree
zpe.thermalcorrgfe: 0.311446 hartree
zpe.sumelectzpe: -1333.882078 hartree
zpe.sumelectthermal: -1333.855552 hartree
zpe.sumelectthermalent: -1333.854607 hartree
zpe.sumelectthermalfe: -1333.946188 hartree
dipole: -1.3060 -2.5186 4.8657
dipole: 5.6324
quadrupole: -189.0523 -180.5129 -159.6688
quadrupole: 6.1334 7.3162 7.5396
quadrupole: -12.6410 -4.1016 16.7426 6.1334 7.3162 7.5396
hfenergy: -1334.2576342 hartree
pointgroup: C01 [X(C22H20N2O5)]
dipole: 0.3980974 1.1011165 1.8813715 debye
polarizability: 278.5558773|-27.6155661|260.7319825|2.5652353|18.9868574|251.4836574 unknown
InChI: InChI=1S/C22H20N2O5/c1-16-6-2-3-9-20(16)27-14-19(29-22(26)18-8-5-11-24-13-18)15-28-21(25)17-7-4-10-23-12-17/h2-13,19H,14-15H2,1H3
charge 0 multiplicity 1
49 atoms
O  1.997844 1.409818 -0.721133
O  0.63049 -1.149021 -0.398493
O  -2.036062 0.002843 -1.015321
O  1.26868 -2.691623 -2.031568
O  -3.694157 -0.068313 -2.65415
N  2.215292 -5.491489 1.047622
N  -6.602503 0.937815 0.30559
C  0.352882 -0.155193 -1.477102
C  0.552452 1.221817 -0.852825
C  -1.042496 -0.365843 -2.058569
C  2.451976 2.590307 -0.09416
C  3.867229 2.682862 0.051199
C  1.593579 3.619762 0.358177
C  1.126214 -2.391044 -0.820995
C  4.386805 3.843574 0.666503
C  4.759904 1.564124 -0.445059
C  2.147611 4.768641 0.969905
C  1.445799 -3.277407 0.331451
C  3.544088 4.884823 1.126633
C  -3.36496 0.099456 -1.456261
C  -4.294256 0.424229 -0.33937
C  1.331569 -2.855478 1.68056
C  1.891352 -4.60085 0.068453
C  -3.871233 0.524721 1.010572
C  -5.667142 0.637075 -0.638613
C  1.664272 -3.767769 2.702962
C  -4.829933 0.834653 1.997062
C  2.098148 -5.065953 2.343034
C  -6.17447 1.032709 1.601927
H  1.086524 -0.319936 -2.28858
H  0.118831 2.000082 -1.514635
H  0.055446 1.272314 0.134266
H  -1.19797 0.271425 -2.948447
H  -1.196955 -1.41726 -2.353374
H  0.508367 3.546437 0.239525
H  5.473358 3.93046 0.786034
H  5.820361 1.782045 -0.23317
H  4.644398 1.413197 -1.534306
H  4.495775 0.601625 0.030274
H  1.482906 5.56676 1.318461
H  3.97621 5.773062 1.599203
H  0.996555 -1.839412 1.904745
H  1.988717 -4.946216 -0.966319
H  -2.821466 0.355613 1.264996
H  -6.016081 0.559983 -1.673926
H  1.594159 -3.48482 3.757524
H  -4.548916 0.919946 3.051029
H  2.36624 -5.801651 3.109815
H  -6.947537 1.274299 2.340152
