program: Gaussian 09
title: 000029408
version: EM64L-G09RevD.01
frameworkgroup: C1[X(C15H26)]
method: RPBEPBE
basis: SDD
operation: Freq
keyword: #p
keyword: freq=noraman
keyword: PBEPBE/SDD
title: #p freq=noraman PBEPBE/SDD
converged: YES YES NO NO
title: Mulliken charges:
elementType: C C C C C C C C C C C C C C C H H H H H H H H H H H H H H H H H H H H H H H H H H
charge: 0.381747 0.337315 -0.098531 -0.111065 -0.179582 -0.591683 -0.588060 -0.105470 -0.482616 -0.480041 -0.444130 -0.812069 -0.808189 -0.756169 -0.756614 0.188549 0.206138 0.227796 0.200260 0.229891 0.209033 0.215215 0.204053 0.194524 0.205123 0.216157 0.205430 0.199623 0.198215 0.210795 0.231419 0.217442 0.231627 0.214731 0.208313 0.212984 0.211184 0.217180 0.204501 0.219755 0.215222
chargesum: 0.00000
title: Mulliken charges with hydrogens summed into heavy atoms:
elementType: C C C C C C C C C C C C C C C
charge: 0.381747 0.337315 0.090018 0.095073 0.048213 -0.161532 -0.163812 0.098583 -0.082968 -0.058454 -0.046292 -0.152413 -0.153519 -0.114822 -0.117137
polarizability: 1.60138270e+02 1.04695655e+00 1.47893371e+02 -6.20339013e-01 -2.06393473e-01 1.42611591e+02
1716.lowfreq: -22.4986 -16.7937 -0.0007 -0.0004 0.0001 14.0897 90.8116 117.3978 146.5248
frequency: 90.6096 117.3534 146.4656 167.7714 180.1357 211.0638 216.6423 219.0578 230.7859 257.1092 279.6019 301.9054 339.5526 342.7844 362.1578 375.9048 383.1038 417.3406 453.2399 459.0908 495.4714 512.5368 537.2342 546.9809 595.3043 659.3269 710.5593 767.8592 795.4964 818.3241 833.5735 840.9330 879.7059 901.5581 924.7070 925.3664 937.2629 941.6494 954.6216 966.3705 978.1950 982.7967 1000.5494 1004.9897 1029.2179 1048.7718 1066.0698 1084.6742 1094.3054 1103.7440 1114.9163 1132.4335 1144.3987 1154.2439 1168.8201 1185.5906 1197.1254 1204.7573 1215.3067 1218.3706 1232.5533 1248.8879 1276.8864 1282.8278 1285.1514 1290.1297 1298.9362 1307.0423 1309.8342 1313.1976 1328.0798 1345.0429 1345.4869 1353.3376 1380.1851 1383.0487 1383.5478 1397.2423 1457.4348 1462.3782 1469.0535 1470.0482 1471.0137 1472.7486 1475.0688 1478.0826 1483.8379 1485.6807 1488.9492 1494.6174 1505.0863 2961.3461 2962.9566 2965.5890 2969.3519 2969.8083 2970.9383 2974.0830 2975.6072 2978.7196 2981.8099 2985.4777 2999.5181 3005.4107 3014.1477 3034.2175 3035.8285 3044.0239 3046.3151 3053.4286 3055.8244 3056.4353 3060.5893 3061.5145 3071.5288 3093.6880 3096.9536
redmass: 2.5188 2.4447 2.0450 1.9141 1.5235 1.3199 1.2868 1.2231 1.6491 1.8296 2.2273 2.0077 2.6681 2.3168 2.6433 1.9853 2.7819 2.3606 2.5040 2.8130 3.1842 2.7175 2.5945 2.4672 2.8248 3.4379 2.5436 2.0983 1.9625 2.2786 2.1108 2.1218 2.0372 1.8344 1.9072 1.5889 1.4386 1.6497 1.5295 1.9096 1.6261 1.6895 1.4785 1.7152 2.1263 2.2740 1.6996 1.9056 2.1889 1.8572 1.7124 2.5908 1.6014 2.1054 2.3012 2.1421 1.7536 1.9589 1.8576 1.8722 1.4385 1.9713 1.4000 1.4160 1.3486 1.3288 1.3936 1.3577 1.4201 1.5738 1.3271 1.4422 1.4176 1.4411 1.1999 1.2135 1.2083 1.1969 1.0683 1.0777 1.0668 1.0662 1.0617 1.0546 1.0512 1.0580 1.0736 1.0689 1.0620 1.0623 1.0625 1.0664 1.0485 1.0588 1.0399 1.0414 1.0642 1.0716 1.0426 1.0762 1.0788 1.0643 1.0736 1.0629 1.0992 1.1014 1.0997 1.1024 1.0988 1.1005 1.0985 1.0979 1.0998 1.0994 1.0985 1.0956 1.0950
irintensity: 0.0057 0.0123 0.0110 0.0354 0.0109 0.0383 0.0412 0.0365 0.0828 0.0296 0.0699 0.1974 0.0860 0.0535 0.3687 0.3214 0.3822 0.0345 0.1673 0.6002 0.7771 0.7007 1.5771 1.0201 0.3463 0.3061 0.3574 0.8763 1.0579 1.5047 0.3739 2.7322 0.0404 0.2558 4.0411 0.3135 2.8665 4.1311 1.7280 0.4215 15.8167 5.0675 0.2185 0.3944 1.8834 0.4219 2.3401 2.1346 2.0761 1.3160 3.0158 1.5214 5.4420 0.7104 1.5451 2.5830 1.9252 1.4478 3.2864 6.0157 0.6780 0.1871 0.7177 1.4400 2.0371 1.9536 0.2320 1.4502 2.1613 0.6641 1.4769 0.3878 0.8426 4.1940 10.6872 9.9231 23.3646 26.5367 0.6673 2.0627 14.4793 12.5019 7.2763 4.3667 1.6657 19.7220 6.4926 14.4661 0.3153 18.5621 5.9041 8.0292 26.5413 5.0120 20.4292 30.2041 30.5834 18.3020 27.9826 41.8153 106.0666 45.3524 108.4689 18.4774 27.4556 48.3540 30.6957 49.3524 7.8316 31.4817 96.6809 43.5346 32.0623 79.5477 46.0310 49.8913 22.9448
temp: 298.150 k
press: 1.00000 atm
elementType: 6 6 6 6 6 6 6 6 6 6 6 6 6 6 6 1 1 1 1 1 1 1 1 1 1 1 1 1 1 1 1 1 1 1 1 1 1 1 1 1 1
symmnumber: 1
zpe: 984684.1 jmol-1
zpe.correction: 0.375046 hartree
zpe.thermalcorrener: 0.389982 hartree
zpe.thermalcorrenthalpy: 0.390926 hartree
zpe.thermalcorrgfe: 0.335943 hartree
zpe.sumelectzpe: -585.987534 hartree
zpe.sumelectthermal: -585.972599 hartree
zpe.sumelectthermalent: -585.971655 hartree
zpe.sumelectthermalfe: -586.026638 hartree
dipole: -0.2102 -0.0413 0.0066
dipole: 0.2143
quadrupole: -96.1265 -95.3969 -95.9320
quadrupole: -0.4227 -0.2291 0.1747
quadrupole: -0.3080 0.4215 -0.1135 -0.4227 -0.2291 0.1747
hfenergy: -586.3625808 hartree
pointgroup: C01 [X(C15H26)]
dipole: 0.082405 0.0178214 -0.0004358 debye
polarizability: 160.1149859|1.2891137|147.9429307|0.0152698|0.0773065|142.5853162 unknown
InChI: InChI=1S/C15H26/c1-10-7-8-15-11(2)5-6-12(9-13(10)15)14(15,3)4/h10-13H,5-9H2,1-4H3
charge 0 multiplicity 1
41 atoms
C  0.021324 -0.202928 -0.560192
C  1.048229 1.018864 -0.52464
C  -0.837863 -0.002363 0.749565
C  1.416111 0.991794 0.999752
C  0.840473 -1.541524 -0.442248
C  0.017447 0.900009 1.692832
C  -1.004789 -0.184545 -1.739382
C  -2.242608 0.47828 0.286709
C  2.299585 -0.241249 1.32328
C  -2.410366 -0.253889 -1.073805
C  1.626944 -1.579165 0.90726
C  2.258584 0.875742 -1.485259
C  0.407247 2.393858 -0.869232
C  -0.011521 -2.828804 -0.558352
C  -3.367265 0.19271 1.300513
H  -1.000823 -0.985925 1.235253
H  1.95748 1.912312 1.298208
H  1.563227 -1.567319 -1.282166
H  0.101977 0.481779 2.713286
H  -0.431731 1.906264 1.795018
H  -0.846841 -1.007785 -2.458965
H  -0.917577 0.75468 -2.314405
H  -2.215881 1.570804 0.094751
H  2.515904 -0.266672 2.410133
H  3.278204 -0.128659 0.818773
H  -3.207315 0.189216 -1.700442
H  -2.689254 -1.309844 -0.881347
H  2.384853 -2.386749 0.866336
H  0.912881 -1.877303 1.702044
H  2.896457 1.779075 -1.428738
H  2.901688 0.007485 -1.273586
H  1.907586 0.784581 -2.531657
H  -0.533545 2.588936 -0.330259
H  1.117127 3.200647 -0.602672
H  0.200054 2.488256 -1.951237
H  0.632802 -3.719729 -0.43088
H  -0.792786 -2.874464 0.223973
H  -0.508604 -2.917995 -1.540777
H  -3.426966 -0.891083 1.521304
H  -3.19284 0.721736 2.256515
H  -4.353309 0.512366 0.913638
