program: Gaussian 09
title: 000029427
version: EM64L-G09RevD.01
frameworkgroup: C1[X(C14H20N2O)]
method: RPBEPBE
basis: SDD
operation: Freq
keyword: #p
keyword: freq=noraman
keyword: PBEPBE/SDD
title: #p freq=noraman PBEPBE/SDD
converged: YES YES NO NO
title: Mulliken charges:
elementType: O N N C C C C C C C C C C C C C C H H H H H H H H H H H H H H H H H H H H
charge: -0.296122 -0.440607 -0.498974 -0.043750 -0.446714 -0.414015 -0.369166 -0.367600 -0.402226 -0.390799 0.274978 0.477263 -0.453198 -0.346172 -0.198443 -0.214474 -0.262410 0.259808 0.215938 0.202748 0.243453 0.179021 0.175893 0.194656 0.192485 0.195600 0.199990 0.195199 0.199778 0.187359 0.275741 0.284128 0.211798 0.307545 0.222372 0.223077 0.225839
chargesum: 0.00000
title: Mulliken charges with hydrogens summed into heavy atoms:
elementType: O N N C C C C C C C C C C C C C C
charge: -0.296122 -0.164865 -0.214846 0.216058 -0.028028 0.008458 0.001382 0.020484 -0.007036 -0.003662 0.274978 0.477263 -0.241399 -0.038627 0.023929 0.008604 -0.036571
polarizability: 2.50809453e+02 -3.79443808e+00 1.54861986e+02 7.42659167e+00 1.12946287e+01 1.07214179e+02
1716.lowfreq: -7.5965 -3.8426 -0.0010 -0.0008 -0.0007 9.1789 26.1962 31.8051 45.2417
frequency: 22.2552 31.5438 45.1583 58.0913 81.8695 110.4026 163.6553 191.9018 218.9361 229.6620 261.1473 296.7817 314.1559 333.9380 339.9931 398.9017 407.2337 421.0731 460.1914 499.1442 510.0047 537.3378 581.1836 595.7355 614.9487 695.5203 701.5746 714.0680 752.2500 763.3408 787.0433 814.5552 830.7032 837.0612 843.4633 849.5020 909.6112 918.2525 946.5324 963.0334 966.8888 982.7922 995.8720 1005.8513 1018.0026 1025.0530 1027.9050 1065.8894 1083.6460 1090.0957 1134.3177 1146.8506 1170.4145 1175.0408 1186.7208 1195.1086 1199.1502 1211.7005 1231.9842 1265.8712 1276.2855 1281.4653 1309.3327 1319.9986 1330.4381 1331.7617 1337.0777 1346.9421 1355.2539 1357.7854 1365.1631 1383.7163 1425.7927 1457.8598 1460.1309 1465.8944 1467.2915 1470.6181 1478.9821 1483.4645 1487.3761 1511.4308 1597.8216 1616.5553 1637.7314 2956.0728 2957.6516 2961.2863 2970.9863 2972.9937 2980.3460 3011.5539 3016.3718 3022.8370 3025.0179 3029.6189 3038.0781 3047.8979 3102.4457 3128.7662 3140.4789 3163.0290 3194.0722 3522.6222 3532.6794
redmass: 3.8585 4.2027 3.4956 5.6603 4.5292 4.3158 2.1862 3.7166 3.2198 3.1552 2.5231 3.2132 2.1792 1.5672 5.4340 2.4102 2.9207 2.2185 2.2084 1.8924 2.6100 2.3625 1.2389 4.9481 6.2828 1.9844 10.1407 3.6090 3.3293 1.6980 2.0719 1.7698 2.7943 1.2778 1.7250 2.7848 1.4333 2.2684 2.1594 2.2860 1.3470 5.7204 1.3046 2.6347 2.0554 1.7946 2.0509 2.0171 1.9296 1.7085 2.0413 2.0036 1.0531 2.0519 1.1123 1.2340 1.3843 1.6068 1.2317 1.9884 1.2322 1.1693 1.4217 1.4350 1.3303 1.4539 1.4096 1.4077 1.4297 1.3931 1.3994 5.0017 2.3818 1.1120 1.0877 1.1001 1.0998 1.5934 1.1125 1.0846 2.3541 2.2815 6.0216 5.6953 4.3489 1.0589 1.0642 1.0645 1.0655 1.0617 1.0633 1.0968 1.0962 1.0993 1.0891 1.1015 1.0990 1.0965 1.0884 1.0865 1.0932 1.0998 1.0949 1.0766 1.0762
irintensity: 0.5622 0.6189 0.3762 8.7252 2.7895 0.7334 0.9095 0.0622 11.0521 1.4264 6.2102 0.6540 1.4593 12.0912 4.5687 5.2832 0.0739 11.1923 1.8312 5.4068 56.1574 0.4244 101.0678 1.2680 1.5939 49.3870 8.6716 0.8478 2.5536 93.1136 0.1849 12.1428 1.0238 0.1513 5.9495 0.8049 13.4939 3.8513 7.8098 11.8214 0.1268 2.3965 3.1376 0.8971 1.0835 2.9226 13.7321 3.1716 7.4008 6.8427 1.5089 4.8348 0.7987 1.5421 6.3244 36.3648 111.3588 156.1362 14.1876 49.1463 4.5646 6.6586 11.0908 114.2477 5.1193 0.0596 1.0684 1.4281 1.0700 1.2165 2.0281 76.9933 41.1442 42.4430 1.1762 20.2834 39.9250 442.7670 10.3258 18.4739 10.2312 578.7203 45.1068 65.0357 168.6412 30.0953 22.2012 36.0324 11.0392 41.5833 15.0810 72.1100 50.5868 40.2662 35.2480 87.8535 51.9316 46.2372 19.9224 0.4090 35.0275 27.5616 9.1169 7.1629 17.5119
temp: 298.150 k
press: 1.00000 atm
elementType: 8 7 7 6 6 6 6 6 6 6 6 6 6 6 6 6 6 1 1 1 1 1 1 1 1 1 1 1 1 1 1 1 1 1 1 1 1
symmnumber: 1
zpe: 834765.5 jmol-1
zpe.correction: 0.317945 hartree
zpe.thermalcorrener: 0.334095 hartree
zpe.thermalcorrenthalpy: 0.335040 hartree
zpe.thermalcorrgfe: 0.272594 hartree
zpe.sumelectzpe: -728.951057 hartree
zpe.sumelectthermal: -728.934907 hartree
zpe.sumelectthermalent: -728.933963 hartree
zpe.sumelectthermalfe: -728.996409 hartree
dipole: 2.4945 -3.5825 -1.3678
dipole: 4.5747
quadrupole: -95.0488 -97.7019 -106.8408
quadrupole: 2.1285 2.6918 1.5043
quadrupole: 4.8151 2.1619 -6.9770 2.1285 2.6918 1.5043
hfenergy: -729.2690026 hartree
pointgroup: C01 [X(C14H20N2O1)]
dipole: -0.970582 1.4276633 -0.5090241 debye
polarizability: 250.7860299|-4.2639935|155.3898499|-7.2786402|-10.1934062|106.7097387 unknown
InChI: InChI=1S/C14H20N2O/c17-14(16-13-10-6-3-7-11-13)15-12-8-4-1-2-5-9-12/h3,6-7,10-12,15-16H,1-2,4-5,8-9H2
charge 0 multiplicity 1
37 atoms
O  0.478918 -1.346476 0.794697
N  -0.871162 0.490803 0.291234
N  1.449058 0.672521 0.023417
C  -2.133229 -0.216594 0.619593
C  -3.154859 0.77706 1.233714
C  -2.642057 -0.999991 -0.62704
C  -4.027922 1.5818 0.233494
C  -4.118217 -1.469965 -0.569524
C  -5.321946 0.835516 -0.184243
C  -5.124225 -0.407682 -1.085023
C  0.36318 -0.147828 0.392058
C  2.824653 0.322711 -0.053947
C  3.732953 1.340967 -0.457614
C  3.319701 -0.976102 0.244883
C  5.111616 1.068322 -0.564442
C  4.703227 -1.231679 0.130376
C  5.608961 -0.223016 -0.271796
H  -1.855728 -0.953609 1.395567
H  -2.590634 1.462622 1.895958
H  -3.837243 0.210406 1.896694
H  -1.964273 -1.863725 -0.760625
H  -2.512601 -0.363498 -1.526656
H  -3.445117 1.859201 -0.67065
H  -4.323293 2.536584 0.711852
H  -4.384431 -1.784836 0.460309
H  -4.223395 -2.373922 -1.200936
H  -5.9959 1.542184 -0.709877
H  -5.852282 0.532573 0.742885
H  -6.113644 -0.88614 -1.233597
H  -4.786309 -0.077913 -2.08985
H  -0.953136 1.401365 -0.165713
H  1.240724 1.647459 -0.202469
H  3.357652 2.347316 -0.688521
H  2.621171 -1.751885 0.562747
H  5.795891 1.865361 -0.876615
H  5.075222 -2.23637 0.3621
H  6.679877 -0.43664 -0.35444
