program: Gaussian 09
title: 000029382
version: EM64L-G09RevD.01
frameworkgroup: C1[X(C10H13ClO)]
method: RPBEPBE
basis: SDD
operation: Freq
keyword: #p
keyword: freq=noraman
keyword: PBEPBE/SDD
title: #p freq=noraman PBEPBE/SDD
converged: YES YES NO NO
title: Mulliken charges:
elementType: Cl O C C C C C C C C C C H H H H H H H H H H H H H
charge: -0.074143 -0.417424 -0.361280 -0.606390 -0.335723 0.420395 0.079439 -0.691809 -0.381926 -0.336440 -0.114637 -0.209838 0.203953 0.220428 0.200242 0.237410 0.190735 0.200497 0.211788 0.214500 0.219917 0.259467 0.254300 0.256369 0.360172
chargesum: 0.00000
title: Mulliken charges with hydrogens summed into heavy atoms:
elementType: Cl O C C C C C C C C C C
charge: -0.074143 -0.057252 0.063101 -0.168738 0.055510 0.420395 0.079439 -0.045604 -0.122459 -0.082141 -0.114637 0.046531
polarizability: 1.61927737e+02 1.00685811e+01 1.22098698e+02 1.14814136e+01 -7.69690211e+00 7.46746642e+01
1716.lowfreq: -2.4969 0.0015 0.0026 0.0031 6.3053 14.9255 41.0257 65.7573 79.3085
frequency: 40.4683 65.6939 79.0866 115.2980 136.7109 196.6726 207.8649 226.8577 263.0080 292.8628 315.9235 333.6790 358.6773 383.4010 455.7342 467.4054 550.6108 601.8669 627.6440 723.3633 730.8052 750.1488 791.7944 819.1595 866.1902 876.8671 904.3277 919.8579 943.5968 1008.4171 1054.2872 1069.6633 1079.4172 1105.9738 1112.6124 1149.4109 1181.5930 1205.6174 1245.7653 1257.4170 1277.5703 1286.2088 1293.1774 1324.8717 1351.6786 1389.1835 1394.7231 1413.0326 1466.1138 1470.1150 1477.4337 1477.6434 1486.1552 1496.5836 1582.2252 1621.8005 2937.8462 2962.3076 2971.6069 2975.9157 3004.7850 3024.1141 3045.7525 3072.0550 3075.7011 3151.0089 3161.3461 3181.1762 3585.8272
redmass: 4.6275 2.3541 2.0000 4.4276 3.0687 3.2886 4.6303 1.1646 3.6964 1.1907 3.5211 4.8776 12.0906 3.0146 3.3096 2.9845 3.9386 5.3643 7.3982 3.4714 1.1670 3.1970 1.2926 1.4564 3.9455 1.6101 1.7275 1.2861 1.3419 4.1550 1.6450 2.5571 1.9445 2.1373 1.4382 1.4024 2.3478 1.5580 1.5219 1.3897 1.3471 1.1120 1.4075 1.4342 1.5582 5.4371 1.2143 3.6211 1.9364 1.1014 1.0490 1.2099 1.1179 1.1140 7.0453 7.0640 1.0686 1.0594 1.0626 1.0372 1.0964 1.0944 1.1004 1.1006 1.0994 1.0926 1.0885 1.0977 1.0655
irintensity: 0.1350 0.2964 0.1792 0.1148 0.0338 0.6086 1.1630 0.1128 1.3126 125.7518 2.8012 1.9227 2.4856 1.8869 14.8840 17.5804 3.3513 2.8908 31.6488 1.8566 3.9569 10.5523 1.5793 43.8605 22.7554 12.4235 7.8792 5.0401 0.4048 3.8606 7.2373 1.1735 3.2656 12.2159 7.5458 180.0342 57.3603 14.7267 0.6132 1.9807 5.3570 1.5138 11.3303 1.4421 0.7735 18.5463 11.4580 3.9732 102.5156 9.7628 19.0989 11.8063 17.0503 19.7536 1.4563 0.7726 29.2696 17.9436 43.3096 41.1820 8.4008 7.6550 35.4043 74.7766 50.3634 2.8060 1.9878 3.6741 32.2804
temp: 298.150 k
press: 1.00000 atm
elementType: 17 8 6 6 6 6 6 6 6 6 6 6 1 1 1 1 1 1 1 1 1 1 1 1 1
symmnumber: 1
zpe: 535171.6 jmol-1
zpe.correction: 0.203836 hartree
zpe.thermalcorrener: 0.216554 hartree
zpe.thermalcorrenthalpy: 0.217498 hartree
zpe.thermalcorrgfe: 0.163922 hartree
zpe.sumelectzpe: -923.238095 hartree
zpe.sumelectthermal: -923.225377 hartree
zpe.sumelectthermalent: -923.224433 hartree
zpe.sumelectthermalfe: -923.278009 hartree
dipole: 3.2635 -0.1345 0.6743
dipole: 3.3352
quadrupole: -78.2012 -81.6602 -80.9310
quadrupole: -4.8762 3.4601 -1.1556
quadrupole: 2.0629 -1.3961 -0.6668 -4.8762 3.4601 -1.1556
hfenergy: -923.4419315 hartree
pointgroup: C01 [X(C10H13Cl1O1)]
dipole: 1.2819862 -0.1474911 -0.2376882 debye
dipolederiv: -0.466988 0.3266836 0.0001997 0.399075 -0.5192887 0.0343421 -0.0066477 0.0416199 -0.0893237 -0.6960103 0.5800062 -0.0977431 0.5794219 -0.8830139 -0.0496647 -0.1389656 -0.0580317 -0.3392285 -0.0214601 -0.0128895 0.0064386 0.0031477 0.1391832 -0.0281672 0.1315458 0.0053435 0.0268283 -0.0989045 -0.0229373 -0.0347596 -0.0002974 0.1335939 0.0333267 -0.1188172 0.0161916 0.1260706 0.05612 -0.0229583 -0.0261944 -0.0253086 0.178637 -0.0035036 -0.1267258 -0.0169954 0.0960363 0.1724977 0.0105798 -0.0519034 0.2282614 -0.1640755 -0.0444406 -0.1754864 0.0189036 -0.0837075 0.4879079 -0.5851152 0.0327922 -0.6766932 0.6996019 0.0081078 0.0910516 -0.0065932 0.0433985 -0.0732126 -0.0230623 -0.0551718 -0.0197473 0.085636 -0.0123584 -0.0055527 -0.0075861 0.023903 -0.1118339 0.0947273 -0.0482856 0.0608411 -0.1123143 -0.0174555 -0.0246 -0.0236076 -0.0859802 -0.0885112 0.1938426 -0.0714413 -0.0117711 -0.0270394 -0.0408294 -0.0117629 -0.1100624 -0.1252918 0.4811741 -0.5387675 0.0065968 -0.6444369 0.6408274 -0.061707 0.0405915 -0.0643093 -0.0598253 -0.1156026 0.0511587 -0.0401003 0.1727613 -0.0809989 -0.0506578 -0.0574419 -0.0294578 -0.0889018 0.0552598 -0.0233654 0.0049609 -0.0183324 -0.0708804 0.128131 0.0330191 0.0896334 -0.0348441 0.0341166 0.0478547 0.0241294 0.0335412 -0.0632177 -0.1094282 0.0276035 -0.0788082 -0.0050694 -0.0219353 0.0481807 0.0605702 0.0583287 -0.0885582 -0.1393508 0.028407 -0.071818 -0.0001947 0.057206 0.0059478 -0.0046469 -0.0411332 -0.0545211 0.1327172 0.0054179 0.0649183 -0.0023207 0.0211492 0.013572 0.0103563 0.051535 -0.1041575 -0.1482456 0.0305067 -0.1146326 -0.0319813 0.0291475 0.0131731 -0.0266469 -0.0247683 -0.0666094 0.1440727 0.0126302 0.122264 -0.0615405 0.0960938 -0.0326886 0.0082588 0.0094791 -0.0738514 0.1414961 -0.0348063 0.1059517 -0.0325914 0.0805124 0.0770555 0.036571 0.0303324 -0.0852386 -0.125813 -0.0118498 -0.1030496 -0.0007633 -0.2233603 -0.0369363 0.045652 -0.0370209 0.0979418 0.0031218 0.067621 0.0055707 0.052044 0.0917775 -0.0477052 0.0430349 -0.0391973 -0.0045875 0.0591538 0.0367186 0.0637051 0.1162887 0.0793447 -0.0137958 0.0290569 -0.0269271 -0.0271751 0.0677876 0.0372187 0.0684198 0.1371308 -0.0294389 -0.011028 0.064285 -0.0021056 0.1082159 0.0202686 0.0625954 0.0235472 0.1411497 0.2049504 -0.0915325 0.0839906 -0.0589856 0.3418907 0.0590966 0.1077295 0.0588832 0.2787143 unknown
polarizability: 158.7512559|-16.1282145|123.5883795|-9.8743293|-11.5651877|76.3614635 unknown
InChI: InChI=1S/C10H13ClO/c1-2-3-4-8-7-9(11)5-6-10(8)12/h5-7,12H,2-4H2,1H3
charge 0 multiplicity 1
25 atoms
Cl -3.578687 2.24473 -0.124903
O  0.229882 -2.415755 0.169491
C  2.282632 0.321908 0.219791
C  1.263885 0.133987 -0.94166
C  3.736504 0.470137 -0.281973
C  -0.169248 -0.049413 -0.464624
C  -0.612505 -1.291183 0.07558
C  4.745999 0.675192 0.867623
C  -1.097316 1.019339 -0.516698
C  -1.932702 -1.459472 0.547212
C  -2.408841 0.842375 -0.040427
C  -2.845237 -0.385628 0.492843
H  2.221667 -0.527576 0.931267
H  1.99683 1.221413 0.799394
H  1.586472 -0.72314 -1.574361
H  1.318429 1.019362 -1.602049
H  4.019136 -0.428895 -0.868219
H  3.793678 1.327475 -0.983129
H  4.734682 -0.182989 1.565621
H  4.503869 1.583489 1.450508
H  5.776704 0.784987 0.484189
H  -0.788746 1.984972 -0.930017
H  -2.231226 -2.43146 0.950004
H  -3.869692 -0.506291 0.855653
H  1.123732 -2.218264 -0.204914
