program: Gaussian 09
title: 000029404
version: EM64L-G09RevD.01
frameworkgroup: C1[X(C8H18NO2)]
method: RPBEPBE
basis: SDD
operation: Freq
keyword: #p
keyword: freq=noraman
keyword: PBEPBE/SDD
title: #p freq=noraman PBEPBE/SDD
converged: YES YES NO NO
title: Mulliken charges:
elementType: O O N C C C C C C C C H H H H H H H H H H H H H H H H H H
charge: -0.247430 -0.234331 -0.118069 -0.335502 -0.540802 -0.545170 -0.551006 -0.538530 0.258540 -0.233028 -0.659069 0.271659 0.307942 0.275247 0.265480 0.270088 0.264429 0.265288 0.277145 0.281144 0.271315 0.263903 0.281272 0.255616 0.244416 0.244451 0.234209 0.235370 0.235423
chargesum: 1.00000
title: Mulliken charges with hydrogens summed into heavy atoms:
elementType: O O N C C C C C C C C
charge: -0.247430 -0.234331 -0.118069 0.244099 0.270012 0.261692 0.265357 -0.001642 0.258540 0.255839 0.045933
polarizability: 1.25230354e+02 2.58416675e+00 9.00128871e+01 -1.07957157e-01 1.78484817e-01 7.89554461e+01
1716.lowfreq: -27.9981 -15.5289 -5.9604 -0.0006 0.0005 0.0007 6.3020 26.8291 43.7848
frequency: -21.1088 25.2123 43.4616 65.2019 98.7699 151.2068 171.4772 205.1046 222.0838 249.5856 254.3050 263.2185 305.0492 340.2232 356.8185 397.5229 428.9867 476.1150 487.9614 571.4559 663.7996 734.4674 794.4817 795.1591 800.9672 885.7304 911.5197 922.6459 948.7551 1007.0450 1028.4144 1043.2999 1069.9445 1107.3200 1113.6741 1117.6115 1133.1811 1167.0263 1183.4468 1215.3163 1245.5810 1249.9636 1254.7990 1291.5108 1319.7912 1357.6184 1370.0611 1405.1955 1421.3402 1423.4935 1447.0366 1450.8469 1453.7469 1462.7434 1464.5324 1466.6335 1469.8796 1475.9742 1482.4183 1485.8461 1488.5979 1500.9290 1628.9086 3003.3535 3011.6126 3024.6732 3024.8665 3026.4870 3028.5356 3032.1709 3084.6184 3087.4047 3099.9544 3106.0523 3118.4299 3140.6699 3143.4706 3145.3346 3148.4516 3151.7810 3156.0897
redmass: 2.4032 3.4706 3.7547 2.1626 2.2521 2.0337 1.4282 2.3599 3.3376 1.2398 1.0924 1.1225 3.7299 2.2846 3.1845 2.6961 2.2722 2.6841 2.8821 3.3018 5.7310 3.0958 1.5864 1.9028 1.5587 3.3924 5.2316 2.8041 2.5804 2.1236 1.5340 1.1967 2.1562 1.3703 2.0265 1.8352 1.4584 1.6707 2.0326 1.7360 1.5622 1.1585 1.7869 1.5991 1.2984 1.4149 1.3342 1.2479 1.1417 1.1476 1.0865 1.0818 1.0866 1.0695 1.0395 1.0483 1.0701 1.0737 1.0651 1.0540 1.0603 1.0588 8.9742 1.0363 1.0633 1.0573 1.0346 1.0391 1.0486 1.0350 1.1009 1.1070 1.0984 1.1051 1.1041 1.1057 1.1056 1.1051 1.1053 1.1055 1.1050
irintensity: 0.5099 0.6387 2.1866 0.5926 2.1036 7.9492 2.4680 6.6972 3.2983 1.4099 0.2112 0.7018 10.0006 0.1897 11.9441 0.5140 0.0310 2.1303 0.0145 3.1217 1.0248 2.5548 8.3975 15.6883 9.2019 87.7145 0.2691 10.7816 16.8478 77.5716 6.4857 0.0341 0.3383 9.5977 2.9048 0.9861 7.8719 111.3011 215.1280 21.7678 1.3297 0.4367 7.1032 127.1264 25.8938 5.4013 10.8007 24.6050 18.2108 15.3989 8.4180 5.2063 6.4319 2.1464 16.0647 0.5442 5.3244 0.4304 16.5597 41.7543 57.6402 87.8750 198.8981 9.5387 1.5727 11.3764 0.3935 2.3629 10.7896 2.4885 1.3541 1.8730 16.2141 4.9422 34.3195 0.7050 0.7012 2.0114 8.4181 3.3070 5.8643
temp: 298.150 k
press: 1.00000 atm
elementType: 8 8 7 6 6 6 6 6 6 6 6 1 1 1 1 1 1 1 1 1 1 1 1 1 1 1 1 1 1
symmnumber: 1
zpe: 675345.6 jmol-1
zpe.correction: 0.257226 hartree
zpe.thermalcorrener: 0.270598 hartree
zpe.thermalcorrenthalpy: 0.271542 hartree
zpe.thermalcorrgfe: 0.216527 hartree
zpe.sumelectzpe: -519.681156 hartree
zpe.sumelectthermal: -519.667784 hartree
zpe.sumelectthermalent: -519.666840 hartree
zpe.sumelectthermalfe: -519.721855 hartree
dipole: -9.0337 2.1580 0.0172
dipole: 9.2879
quadrupole: -10.3105 -66.0641 -59.2409
quadrupole: -0.4623 0.0782 0.0255
quadrupole: 34.8947 -20.8590 -14.0357 -0.4623 0.0782 0.0255
hfenergy: -519.9383816 hartree
pointgroup: C01 [X(C8H18N1O2)]
dipole: -3.5477981 0.7426958 -0.4628384 debye
polarizability: 125.2664336|2.0320213|87.156307|-1.1330687|-4.8132177|81.7759464 unknown
InChI: InChI=1S/C8H18NO2/c1-5-11-8(10)6-7-9(2,3)4/h5-7H2,1-4H3
charge 1 multiplicity 1
29 atoms
O  2.345121 0.400719 -0.126954
O  1.217107 -1.331304 0.961919
N  -2.630372 0.179967 -0.019703
C  -1.226069 -0.469645 -0.072174
C  -3.664246 -0.946389 -0.1043
C  -2.83518 0.931681 1.295245
C  -2.832307 1.133373 -1.195448
C  -0.042931 0.510468 -0.096115
C  1.226536 -0.261748 0.307195
C  3.685895 -0.202296 0.244516
C  4.755028 0.715177 -0.329745
H  -1.217288 -1.107516 -0.972891
H  -1.138508 -1.128006 0.809604
H  -3.508269 -1.640747 0.735203
H  -4.675018 -0.514156 -0.050686
H  -3.536673 -1.481489 -1.057416
H  -2.147706 1.787553 1.347132
H  -3.873264 1.295424 1.337841
H  -2.64321 0.245331 2.133742
H  -2.117927 1.965082 -1.1180
H  -2.667833 0.584554 -2.135283
H  -3.861008 1.52438 -1.165854
H  0.122388 0.97382 -1.081969
H  -0.156374 1.328151 0.640821
H  3.721302 -0.273722 1.34565
H  3.716195 -1.221349 -0.178873
H  5.752451 0.308508 -0.084348
H  4.67509 0.786248 -1.42733
H  4.684767 1.729632 0.096922
