program: Gaussian 09
title: 000029441
version: EM64L-G09RevD.01
frameworkgroup: C1[X(C19H19ClN2)]
method: RPBEPBE
basis: SDD
operation: Freq
keyword: #p
keyword: freq=noraman
keyword: PBEPBE/SDD
title: #p freq=noraman PBEPBE/SDD
converged: YES YES NO NO
title: Mulliken charges:
elementType: Cl N N C C C C C C C C C C C C C C C C C C C H H H H H H H H H H H H H H H H H H H
charge: -0.087252 -0.177947 -0.411104 -0.108976 -0.491220 -0.439343 -0.373888 0.371238 -0.496489 0.088129 -0.422424 0.250280 0.449528 -0.400289 -0.337014 -0.444734 -0.378977 -0.113539 -0.216859 -0.221869 -0.237151 -0.246158 0.202731 0.236017 0.213547 0.207926 0.224678 0.181295 0.240012 0.196251 0.247420 0.285488 0.307635 0.258140 0.233543 0.231236 0.256543 0.250805 0.224010 0.222409 0.226371
chargesum: 0.00000
title: Mulliken charges with hydrogens summed into heavy atoms:
elementType: Cl N N C C C C C C C C C C C C C C C C C C C
charge: -0.087252 -0.177947 -0.103469 0.093756 -0.041655 -0.006739 0.047418 0.371238 -0.052818 0.088129 -0.136936 0.250280 0.449528 -0.142149 -0.103470 -0.213499 -0.122434 -0.113539 0.033946 0.002141 -0.014742 -0.019786
polarizability: 3.07665798e+02 8.11388795e+00 1.81104221e+02 2.57534324e+01 1.92661259e+01 1.85701131e+02
1716.lowfreq: -9.7117 -3.5020 -0.0003 0.0021 0.0022 3.0633 13.2181 23.1472 25.9036
frequency: 13.0942 23.0207 25.8605 37.7205 77.4889 79.8319 89.5165 123.0854 149.1990 163.0390 207.4664 230.9996 248.7037 288.5699 311.9451 326.1148 347.8092 352.7180 406.4862 417.7359 427.7959 464.1399 482.7067 523.2821 574.6695 579.6382 587.0281 615.7536 623.1292 626.9687 646.0102 668.7134 705.7021 726.0587 747.9219 753.1351 777.0847 792.7163 803.4495 813.5520 830.5286 860.6466 868.8294 871.8649 873.6245 894.6943 915.4321 927.8636 928.7346 966.6243 983.6561 989.8665 995.2310 1007.2022 1025.1472 1034.1064 1047.6044 1061.6014 1076.0727 1087.4523 1090.4846 1114.6709 1137.7958 1158.9135 1168.4248 1175.0861 1179.2520 1202.1243 1217.2704 1221.7606 1231.3747 1246.5608 1257.3794 1265.9664 1272.9607 1285.2353 1293.0302 1300.8145 1315.9961 1337.6775 1349.1317 1363.4087 1388.5021 1399.3818 1421.1999 1440.2936 1455.3351 1460.4052 1462.6272 1467.8142 1481.3111 1482.1995 1494.3788 1557.3199 1575.3821 1593.2608 1615.0450 1627.8711 2809.8585 2844.2248 2854.8383 2994.7821 3013.2213 3026.0765 3052.7207 3068.8887 3092.9048 3112.3465 3120.5526 3134.3135 3141.2009 3144.6143 3160.4181 3161.8003 3175.3109 3235.8055 3612.4499
redmass: 7.3217 2.8451 4.8386 2.8666 4.1223 3.8220 4.5949 5.9312 3.6742 2.8198 4.0170 4.5661 5.5277 5.0389 3.7173 4.8076 12.3674 2.5070 2.8659 3.0734 4.7988 3.0321 3.9359 1.2788 4.2285 2.7641 6.7334 5.3995 2.9681 3.7798 3.4949 6.3219 2.3020 2.2505 2.0490 2.7818 2.6706 1.5843 3.7946 2.2336 1.4743 1.2744 2.4014 1.6864 4.6696 1.8807 1.4895 1.4306 2.0499 2.0281 1.4010 4.8824 1.5397 1.8082 2.1293 2.4097 2.2138 2.3635 1.7307 2.2023 1.6585 2.4318 1.2688 2.2434 1.0697 1.5302 1.1226 1.5985 1.9260 1.3885 1.9297 1.7080 1.3507 1.3532 1.7374 1.2078 2.2140 1.4313 1.3648 1.5037 1.6493 2.0041 4.1407 4.2374 2.0213 2.1363 3.5154 1.2138 4.6185 1.0869 1.1102 2.1149 1.1019 6.7135 6.7090 6.1852 6.1209 7.1977 1.0802 1.0718 1.0707 1.0851 1.0589 1.0635 1.0883 1.1043 1.1052 1.0867 1.0861 1.0912 1.0897 1.0956 1.1014 1.0928 1.0957 1.0982 1.0810
irintensity: 0.6361 0.6694 0.1651 0.0329 0.8783 0.6434 0.4751 2.9547 2.3872 0.4749 0.9116 2.7665 0.5360 1.2348 1.0242 1.1008 5.4545 4.6352 0.1375 10.3396 1.5517 4.6520 12.3279 84.0716 1.8297 26.8648 6.9548 0.1457 2.4364 1.5445 3.4098 32.2494 25.0564 17.4775 51.3261 12.4126 4.4816 60.0973 5.6798 5.0316 20.1621 0.4377 6.2007 18.9242 49.7121 8.5148 8.3982 0.5271 6.9550 2.4156 0.0198 0.2102 1.6639 7.4661 18.4799 6.3041 7.0299 13.4913 8.6071 27.3760 25.3268 37.1985 0.7606 25.8357 0.5153 6.7199 4.4598 7.4823 16.1243 5.6226 20.0947 0.8607 17.1846 0.8113 33.7377 8.3963 2.6325 1.4466 5.4670 0.7380 1.7474 9.9363 14.8615 45.3874 21.3381 8.4812 17.5171 2.8493 54.9686 2.2273 7.7197 22.2718 0.8119 5.9698 19.3294 1.0551 14.0573 7.8365 48.1215 32.1567 152.4269 11.3919 29.7061 56.1883 37.7057 3.7019 47.9131 8.7464 0.0671 16.8066 9.5810 38.9475 30.9456 1.9002 5.2791 0.0147 62.8310
temp: 298.150 k
press: 1.00000 atm
elementType: 17 7 7 6 6 6 6 6 6 6 6 6 6 6 6 6 6 6 6 6 6 6 1 1 1 1 1 1 1 1 1 1 1 1 1 1 1 1 1 1 1
symmnumber: 1
zpe: 873098.2 jmol-1
zpe.correction: 0.332546 hartree
zpe.thermalcorrener: 0.351519 hartree
zpe.thermalcorrenthalpy: 0.352463 hartree
zpe.thermalcorrgfe: 0.281691 hartree
zpe.sumelectzpe: -1303.419089 hartree
zpe.sumelectthermal: -1303.400115 hartree
zpe.sumelectthermalent: -1303.399171 hartree
zpe.sumelectthermalfe: -1303.469944 hartree
dipole: -2.2182 -1.4116 -2.2754
dipole: 3.4771
quadrupole: -148.8487 -126.2857 -129.1452
quadrupole: -5.9162 -7.0046 8.3030
quadrupole: -14.0888 8.4741 5.6147 -5.9162 -7.0046 8.3030
hfenergy: -1303.7516344 hartree
pointgroup: C01 [X(C19H19Cl1N2)]
dipole: 0.724635 -0.0846731 1.1572323 debye
polarizability: 299.0222006|3.4920773|165.9734551|39.4801497|-8.922097|209.4754941 unknown
InChI: InChI=1S/C19H19ClN2/c20-15-8-9-18-16(11-15)17(12-21-18)19-7-4-10-22(19)13-14-5-2-1-3-6-14/h1-3,5-6,8-9,11-12,19,21H,4,7,10,13H2
charge 0 multiplicity 1
41 atoms
Cl -5.642751 -0.179574 -2.601609
N  1.263291 1.053117 -0.319295
N  -1.945131 -0.639883 2.07469
C  -0.181263 1.324743 -0.587682
C  -0.300807 2.874345 -0.38237
C  1.157614 3.424008 -0.506988
C  2.000958 2.194592 -0.917171
C  -1.097597 0.50215 0.282502
C  1.724942 -0.278757 -0.755534
C  -2.44538 0.069195 -0.037037
C  -0.831623 0.052385 1.576649
C  -2.95464 -0.647167 1.106553
C  3.091678 -0.659239 -0.19263
C  -3.271106 0.218049 -1.184981
C  -4.248521 -1.211139 1.130224
C  3.945121 -1.526806 -0.918481
C  3.512518 -0.195847 1.079521
C  -4.55067 -0.35051 -1.139395
C  -5.055858 -1.057015 -0.01493
C  5.187339 -1.935108 -0.381888
C  4.755751 -0.597347 1.616579
C  5.597644 -1.471854 0.889728
H  -0.42129 1.100063 -1.661407
H  -0.72214 3.089245 0.613612
H  -0.981235 3.312199 -1.133178
H  1.242759 4.239525 -1.245916
H  1.5023 3.813859 0.466132
H  2.0455 2.105386 -2.033053
H  3.038098 2.228011 -0.542632
H  1.752271 -0.360213 -1.872933
H  0.974182 -1.015168 -0.405756
H  0.077325 0.1724 2.161661
H  -1.999088 -1.085974 2.987429
H  -2.927584 0.755323 -2.073509
H  -4.628751 -1.753947 2.002152
H  3.636347 -1.884248 -1.909296
H  2.855008 0.490359 1.625659
H  -6.065639 -1.475588 -0.044505
H  5.835689 -2.607059 -0.956013
H  5.069949 -0.228399 2.600102
H  6.562491 -1.78341 1.305798
