program: Gaussian 09
title: 000029391
version: EM64L-G09RevD.01
frameworkgroup: C1[X(C8H18N2S2)]
method: RPBEPBE
basis: SDD
operation: Freq
keyword: #p
keyword: freq=noraman
keyword: PBEPBE/SDD
title: #p freq=noraman PBEPBE/SDD
converged: YES YES NO NO
title: Mulliken charges:
elementType: S S N N C C C C C C C C H H H H H H H H H H H H H H H H H H
charge: 0.002400 0.021138 -0.090250 0.074654 -0.349425 -0.440757 -0.329578 -0.327122 -0.679175 -0.670502 -0.632191 -0.536507 0.200603 0.248125 0.282961 0.224722 0.201993 0.190229 0.198910 0.190014 0.239346 0.220529 0.202817 0.211376 0.225114 0.206567 0.235728 0.257794 0.261061 0.159427
chargesum: 0.00000
title: Mulliken charges with hydrogens summed into heavy atoms:
elementType: S S N N C C C C C C C C
charge: 0.161827 0.021138 -0.090250 0.074654 0.099303 0.066925 0.062644 0.061801 -0.016482 -0.027445 0.122391 -0.536507
polarizability: 1.71614742e+02 -8.95878926e-01 1.52239190e+02 7.48869146e+00 -2.85287401e+00 8.91810679e+01
1716.lowfreq: -15.4793 -8.9990 -7.4133 -0.0012 0.0017 0.0018 11.7676 33.9787 43.5886
frequency: -1.4935 33.1038 43.4811 57.7380 62.9662 94.4507 101.5912 137.7721 152.4141 215.1796 235.4018 252.0082 280.0269 289.5670 308.0558 319.1957 331.7819 380.9718 403.9800 438.0657 459.0077 500.0915 545.1872 568.6266 743.8887 765.1101 790.9585 800.6528 824.2817 883.3032 914.7489 973.0309 986.3565 1029.6167 1042.4641 1075.7009 1079.1078 1084.9663 1086.4597 1104.4189 1123.6439 1177.5052 1212.0054 1229.8790 1252.5858 1283.3290 1289.0622 1303.5558 1328.2899 1358.2211 1361.1360 1376.5949 1383.9633 1393.1869 1398.8918 1438.0489 1461.0577 1463.3012 1467.8425 1469.0147 1470.7945 1478.2902 1484.8776 1488.0692 1492.3731 1499.9093 2470.8598 2848.3168 2861.0574 2921.3440 2978.5074 2978.9063 2983.1269 3008.9340 3014.4934 3033.6604 3042.1423 3059.9518 3074.3047 3076.0611 3087.6527 3091.2751 3092.7362 3115.1992
redmass: 3.8266 3.1734 3.8922 2.4383 4.0735 2.0171 1.4411 1.8913 2.4598 1.2871 1.4525 3.8872 2.0419 3.1986 3.3823 3.2058 1.1938 2.6480 3.4646 3.2584 2.8487 3.4705 6.1673 4.5178 2.7005 1.1911 1.1856 1.1721 1.4875 3.3064 1.9224 2.9142 2.2596 2.9544 2.0817 2.4922 2.3028 1.8883 1.9124 1.3056 1.7176 1.7571 2.3094 2.7517 1.6308 1.1835 1.2452 1.2508 1.2483 1.3165 1.3538 1.3352 1.2439 1.2365 1.9307 1.1057 1.0520 1.0650 1.1243 1.0827 1.0670 1.0683 1.0621 1.0613 1.0833 1.3682 1.0377 1.0713 1.0715 1.0689 1.0355 1.0357 1.0356 1.0875 1.0630 1.0876 1.0901 1.1014 1.0991 1.0983 1.1004 1.1005 1.1044 1.0990
irintensity: 0.6847 0.1646 0.9465 0.1525 1.5407 0.1995 0.2744 2.3081 0.1541 1.1748 0.1556 0.3090 3.5908 1.8676 9.6279 11.5544 27.3318 11.0606 11.2833 7.7958 7.7563 8.3808 4.4588 11.9893 6.3311 6.3621 5.2499 3.1939 21.0948 47.7357 2.4154 125.6112 3.5854 14.9889 4.8093 23.9127 42.0566 16.9261 8.2409 0.4228 16.0794 61.6534 20.3976 48.6594 27.6559 4.8105 25.5506 25.6499 3.6768 8.0509 2.2108 8.6063 29.0222 7.5959 98.4092 25.6490 6.8737 5.1487 17.7353 3.1559 9.1093 5.0374 14.5979 11.1435 14.8333 127.2386 2.3942 65.2636 158.6579 65.3623 35.1712 20.8429 33.5485 24.3039 28.1680 23.5709 19.6920 16.4482 24.4447 71.3372 34.0572 44.8381 7.4280 15.7388
temp: 298.150 k
press: 1.00000 atm
elementType: 16 16 7 7 6 6 6 6 6 6 6 6 1 1 1 1 1 1 1 1 1 1 1 1 1 1 1 1 1 1
symmnumber: 1
zpe: 662848.9 jmol-1
zpe.correction: 0.252466 hartree
zpe.thermalcorrener: 0.267820 hartree
zpe.thermalcorrenthalpy: 0.268765 hartree
zpe.thermalcorrgfe: 0.208487 hartree
zpe.sumelectzpe: -1220.253275 hartree
zpe.sumelectthermal: -1220.237921 hartree
zpe.sumelectthermalent: -1220.236976 hartree
zpe.sumelectthermalfe: -1220.297254 hartree
dipole: -1.7339 -3.6948 0.9126
dipole: 4.1822
quadrupole: -88.4716 -88.3688 -92.7815
quadrupole: -3.0979 -0.2492 1.7857
quadrupole: 1.4024 1.5052 -2.9075 -3.0979 -0.2492 1.7857
hfenergy: -1220.5057411 hartree
pointgroup: C01 [X(C8H18N2S2)]
dipole: -0.5776941 1.5051253 -0.3289386 debye
polarizability: 170.1927255|-1.0026652|152.202805|-13.2386049|-2.489422|90.6394697 unknown
InChI: InChI=1S/C8H18N2S2/c1-4-10(5-2)7-6-9(3)8(11)12/h11H,4-7H2,1-3H3
charge 0 multiplicity 1
30 atoms
S  4.334467 -0.107497 -0.772399
S  2.147275 -2.185538 -0.002926
N  -1.971579 0.086016 -0.212042
N  1.814093 0.541385 -0.028077
C  -0.587347 0.170526 -0.727319
C  0.411591 0.372896 0.441758
C  -2.696831 -1.147824 -0.609621
C  -2.749474 1.340973 -0.366329
C  -2.148969 -2.407498 0.088674
C  -3.863966 1.502814 0.686051
C  2.288013 1.916837 -0.301473
C  2.608556 -0.555022 -0.225844
H  -0.476345 0.99812 -1.464211
H  -0.311684 -0.762354 -1.25182
H  0.366348 -0.508482 1.102255
H  0.135689 1.26717 1.029272
H  -3.758466 -1.020323 -0.329946
H  -2.675233 -1.293084 -1.719545
H  -2.04171 2.185504 -0.256919
H  -3.188665 1.430598 -1.393126
H  -1.080976 -2.575144 -0.14166
H  -2.246749 -2.307037 1.184002
H  -2.710401 -3.303237 -0.237156
H  -4.629008 0.710225 0.602783
H  -3.436116 1.456446 1.702713
H  -4.37641 2.474672 0.557619
H  1.442678 2.612492 -0.189533
H  2.681273 2.004652 -1.330609
H  3.086032 2.210662 0.406201
H  4.728614 -1.428648 -0.838574
